{"text_format":"1","workbook":"xlsx","n_sheets":3,"sheets":["Jul 2023 Online","Sheet2","Sheet1"],"not_rendered":{"charts":0,"images":0,"macros":0,"external_links":1,"defined_names":2,"comments":0,"pivot_tables":0},"unopened":[],"bounds":{"document_bytes":16777216,"sheet_cells":100000,"rows_first":2000,"rows_last":500,"rows_between":2000,"halvings":0,"cell_chars":16384,"cell_head_chars":4096},"cells_cut":0,"cells_raw":0,"read":"whole","date_system":"1900"}

{"sheet":"Jul 2023 Online","index":0,"n_rows":5525,"n_cols":7,"rows_kept":5525,"cut":false,"hidden":false,"merged":[]}
[null,null,null,null,"CPT® HCPCS Code","July 2023 ASC Payment Amount","Subject To Multiple Procedure Discounting"]
[null,null,null,null,10004,"Bundled","NA"]
[null,null,null,null,10005,563.74037104996432,{"$f":"VLOOKUP(E3,'[1]Combined AA and BB'!$A$1:$C$6133,3,FALSE)","v":"Y"}]
[null,null,null,null,10006,"Bundled","NA"]
[null,null,null,null,10007,560.86680000000001,{"$f":"VLOOKUP(E5,'[1]Combined AA and BB'!$A$1:$C$6133,3,FALSE)","v":"Y"}]
[null,null,null,null,10008,"Bundled","NA"]
[null,null,null,null,10009,563.74037104996432,{"$f":"VLOOKUP(E7,'[1]Combined AA and BB'!$A$1:$C$6133,3,FALSE)","v":"Y"}]
[null,null,null,null,10010,"Bundled","NA"]
[null,null,null,null,10011,563.74037104996432,{"$f":"VLOOKUP(E9,'[1]Combined AA and BB'!$A$1:$C$6133,3,FALSE)","v":"Y"}]
[null,null,null,null,10012,"Bundled","NA"]
[null,null,null,null,10021,"Not covered","NA"]
[null,null,null,null,10030,563.74037104996432,{"$f":"VLOOKUP(E12,'[1]Combined AA and BB'!$A$1:$C$6133,3,FALSE)","v":"Y"}]
[null,null,null,null,10035,"Not covered","NA"]
[null,null,null,null,10036,"Not covered","NA"]
[null,null,null,null,10040,"Bundled","NA"]
[null,null,null,null,10060,234.58759999999998,{"$f":"VLOOKUP(E16,'[1]Combined AA and BB'!$A$1:$C$6133,3,FALSE)","v":"Y"}]
[null,null,null,null,10061,394.15480000000002,{"$f":"VLOOKUP(E17,'[1]Combined AA and BB'!$A$1:$C$6133,3,FALSE)","v":"Y"}]
[null,null,null,null,10080,478.70159999999993,{"$f":"VLOOKUP(E18,'[1]Combined AA and BB'!$A$1:$C$6133,3,FALSE)","v":"Y"}]
[null,null,null,null,10081,647.19979999999998,{"$f":"VLOOKUP(E19,'[1]Combined AA and BB'!$A$1:$C$6133,3,FALSE)","v":"Y"}]
[null,null,null,null,10120,284.00579999999997,{"$f":"VLOOKUP(E20,'[1]Combined AA and BB'!$A$1:$C$6133,3,FALSE)","v":"Y"}]
[null,null,null,null,10121,1062.8859418079082,{"$f":"VLOOKUP(E21,'[1]Combined AA and BB'!$A$1:$C$6133,3,FALSE)","v":"Y"}]
[null,null,null,null,10140,315.56200000000001,{"$f":"VLOOKUP(E22,'[1]Combined AA and BB'!$A$1:$C$6133,3,FALSE)","v":"Y"}]
[null,null,null,null,10160,242.32780000000002,{"$f":"VLOOKUP(E23,'[1]Combined AA and BB'!$A$1:$C$6133,3,FALSE)","v":"Y"}]
[null,null,null,null,10180,1789.2422303467429,{"$f":"VLOOKUP(E24,'[1]Combined AA and BB'!$A$1:$C$6133,3,FALSE)","v":"Y"}]
[null,null,null,null,11000,107.76739999999999,{"$f":"VLOOKUP(E25,'[1]Combined AA and BB'!$A$1:$C$6133,3,FALSE)","v":"Y"}]
[null,null,null,null,11001,"Bundled","NA"]
[null,null,null,null,11010,563.74037104996432,{"$f":"VLOOKUP(E27,'[1]Combined AA and BB'!$A$1:$C$6133,3,FALSE)","v":"Y"}]
[null,null,null,null,11011,563.74037104996432,{"$f":"VLOOKUP(E28,'[1]Combined AA and BB'!$A$1:$C$6133,3,FALSE)","v":"Y"}]
[null,null,null,null,11012,1789.2422303467429,{"$f":"VLOOKUP(E29,'[1]Combined AA and BB'!$A$1:$C$6133,3,FALSE)","v":"Y"}]
[null,null,null,null,11042,324.06399005482393,{"$f":"VLOOKUP(E30,'[1]Combined AA and BB'!$A$1:$C$6133,3,FALSE)","v":"Y"}]
[null,null,null,null,11043,504.64741795035388,{"$f":"VLOOKUP(E31,'[1]Combined AA and BB'!$A$1:$C$6133,3,FALSE)","v":"Y"}]
[null,null,null,null,11044,1062.8859418079082,{"$f":"VLOOKUP(E32,'[1]Combined AA and BB'!$A$1:$C$6133,3,FALSE)","v":"Y"}]
[null,null,null,null,11045,"Bundled","NA"]
[null,null,null,null,11046,"Bundled","NA"]
[null,null,null,null,11047,"Bundled","NA"]
[null,null,null,null,11055,"Bundled","NA"]
[null,null,null,null,11056,"Bundled","NA"]
[null,null,null,null,11057,169.68899999999999,{"$f":"VLOOKUP(E38,'[1]Combined AA and BB'!$A$1:$C$6133,3,FALSE)","v":"Y"}]
[null,null,null,null,11102,191.71880000000002,{"$f":"VLOOKUP(E39,'[1]Combined AA and BB'!$A$1:$C$6133,3,FALSE)","v":"Y"}]
[null,null,null,null,11103,"Bundled","NA"]
[null,null,null,null,11104,237.56460000000001,{"$f":"VLOOKUP(E41,'[1]Combined AA and BB'!$A$1:$C$6133,3,FALSE)","v":"Y"}]
[null,null,null,null,11105,"Bundled","NA"]
[null,null,null,null,11106,294.12760000000003,{"$f":"VLOOKUP(E43,'[1]Combined AA and BB'!$A$1:$C$6133,3,FALSE)","v":"Y"}]
[null,null,null,null,11107,"Bundled","NA"]
[null,null,null,null,11200,"Bundled","NA"]
[null,null,null,null,11201,"Bundled","NA"]
[null,null,null,null,11300,"Bundled","NA"]
[null,null,null,null,11301,"Bundled","NA"]
[null,null,null,null,11302,"Bundled","NA"]
[null,null,null,null,11303,"Bundled","NA"]
[null,null,null,null,11305,"Bundled","NA"]
[null,null,null,null,11306,"Bundled","NA"]
[null,null,null,null,11307,156.86319990561176,{"$f":"VLOOKUP(E53,'[1]Combined AA and BB'!$A$1:$C$6133,3,FALSE)","v":"Y"}]
[null,null,null,null,11308,"Bundled","NA"]
[null,null,null,null,11310,220.298,{"$f":"VLOOKUP(E55,'[1]Combined AA and BB'!$A$1:$C$6133,3,FALSE)","v":"Y"}]
[null,null,null,null,11311,156.86319990561176,{"$f":"VLOOKUP(E56,'[1]Combined AA and BB'!$A$1:$C$6133,3,FALSE)","v":"Y"}]
[null,null,null,null,11312,294.12760000000003,{"$f":"VLOOKUP(E57,'[1]Combined AA and BB'!$A$1:$C$6133,3,FALSE)","v":"Y"}]
[null,null,null,null,11313,339.97339999999997,{"$f":"VLOOKUP(E58,'[1]Combined AA and BB'!$A$1:$C$6133,3,FALSE)","v":"Y"}]
[null,null,null,null,11400,241.73239999999998,{"$f":"VLOOKUP(E59,'[1]Combined AA and BB'!$A$1:$C$6133,3,FALSE)","v":"Y"}]
[null,null,null,null,11401,293.53219999999999,{"$f":"VLOOKUP(E60,'[1]Combined AA and BB'!$A$1:$C$6133,3,FALSE)","v":"Y"}]
[null,null,null,null,11402,322.1114,{"$f":"VLOOKUP(E61,'[1]Combined AA and BB'!$A$1:$C$6133,3,FALSE)","v":"Y"}]
[null,null,null,null,11403,369.14800000000002,{"$f":"VLOOKUP(E62,'[1]Combined AA and BB'!$A$1:$C$6133,3,FALSE)","v":"Y"}]
[null,null,null,null,11404,1062.8859418079082,{"$f":"VLOOKUP(E63,'[1]Combined AA and BB'!$A$1:$C$6133,3,FALSE)","v":"Y"}]
[null,null,null,null,11406,1062.8859418079082,{"$f":"VLOOKUP(E64,'[1]Combined AA and BB'!$A$1:$C$6133,3,FALSE)","v":"Y"}]
[null,null,null,null,11420,239.9462,{"$f":"VLOOKUP(E65,'[1]Combined AA and BB'!$A$1:$C$6133,3,FALSE)","v":"Y"}]
[null,null,null,null,11421,300.08159999999998,{"$f":"VLOOKUP(E66,'[1]Combined AA and BB'!$A$1:$C$6133,3,FALSE)","v":"Y"}]
[null,null,null,null,11422,335.80559999999997,{"$f":"VLOOKUP(E67,'[1]Combined AA and BB'!$A$1:$C$6133,3,FALSE)","v":"Y"}]
[null,null,null,null,11423,381.65140000000002,{"$f":"VLOOKUP(E68,'[1]Combined AA and BB'!$A$1:$C$6133,3,FALSE)","v":"Y"}]
[null,null,null,null,11424,1062.8859418079082,{"$f":"VLOOKUP(E69,'[1]Combined AA and BB'!$A$1:$C$6133,3,FALSE)","v":"Y"}]
[null,null,null,null,11426,1789.2422303467429,{"$f":"VLOOKUP(E70,'[1]Combined AA and BB'!$A$1:$C$6133,3,FALSE)","v":"Y"}]
[null,null,null,null,11440,270.90699999999998,{"$f":"VLOOKUP(E71,'[1]Combined AA and BB'!$A$1:$C$6133,3,FALSE)","v":"Y"}]
[null,null,null,null,11441,326.2792,{"$f":"VLOOKUP(E72,'[1]Combined AA and BB'!$A$1:$C$6133,3,FALSE)","v":"Y"}]
[null,null,null,null,11442,362.00319999999999,{"$f":"VLOOKUP(E73,'[1]Combined AA and BB'!$A$1:$C$6133,3,FALSE)","v":"Y"}]
[null,null,null,null,11443,425.11559999999997,{"$f":"VLOOKUP(E74,'[1]Combined AA and BB'!$A$1:$C$6133,3,FALSE)","v":"Y"}]
[null,null,null,null,11444,1062.8859418079082,{"$f":"VLOOKUP(E75,'[1]Combined AA and BB'!$A$1:$C$6133,3,FALSE)","v":"Y"}]
[null,null,null,null,11446,1789.2422303467429,{"$f":"VLOOKUP(E76,'[1]Combined AA and BB'!$A$1:$C$6133,3,FALSE)","v":"Y"}]
[null,null,null,null,11450,1789.2422303467429,{"$f":"VLOOKUP(E77,'[1]Combined AA and BB'!$A$1:$C$6133,3,FALSE)","v":"Y"}]
[null,null,null,null,11451,1789.2422303467429,{"$f":"VLOOKUP(E78,'[1]Combined AA and BB'!$A$1:$C$6133,3,FALSE)","v":"Y"}]
[null,null,null,null,11462,1789.2422303467429,{"$f":"VLOOKUP(E79,'[1]Combined AA and BB'!$A$1:$C$6133,3,FALSE)","v":"Y"}]
[null,null,null,null,11463,1789.2422303467429,{"$f":"VLOOKUP(E80,'[1]Combined AA and BB'!$A$1:$C$6133,3,FALSE)","v":"Y"}]
[null,null,null,null,11470,1789.2422303467429,{"$f":"VLOOKUP(E81,'[1]Combined AA and BB'!$A$1:$C$6133,3,FALSE)","v":"Y"}]
[null,null,null,null,11471,1789.2422303467429,{"$f":"VLOOKUP(E82,'[1]Combined AA and BB'!$A$1:$C$6133,3,FALSE)","v":"Y"}]
[null,null,null,null,11600,370.93420000000003,{"$f":"VLOOKUP(E83,'[1]Combined AA and BB'!$A$1:$C$6133,3,FALSE)","v":"Y"}]
[null,null,null,null,11601,428.0926,{"$f":"VLOOKUP(E84,'[1]Combined AA and BB'!$A$1:$C$6133,3,FALSE)","v":"Y"}]
[null,null,null,null,11602,457.86260000000004,{"$f":"VLOOKUP(E85,'[1]Combined AA and BB'!$A$1:$C$6133,3,FALSE)","v":"Y"}]
[null,null,null,null,11603,520.37959999999998,{"$f":"VLOOKUP(E86,'[1]Combined AA and BB'!$A$1:$C$6133,3,FALSE)","v":"Y"}]
[null,null,null,null,11604,563.74037104996432,{"$f":"VLOOKUP(E87,'[1]Combined AA and BB'!$A$1:$C$6133,3,FALSE)","v":"Y"}]
[null,null,null,null,11606,1062.8859418079082,{"$f":"VLOOKUP(E88,'[1]Combined AA and BB'!$A$1:$C$6133,3,FALSE)","v":"Y"}]
[null,null,null,null,11620,372.72039999999998,{"$f":"VLOOKUP(E89,'[1]Combined AA and BB'!$A$1:$C$6133,3,FALSE)","v":"Y"}]
[null,null,null,null,11621,430.4742,{"$f":"VLOOKUP(E90,'[1]Combined AA and BB'!$A$1:$C$6133,3,FALSE)","v":"Y"}]
[null,null,null,null,11622,472.74760000000003,{"$f":"VLOOKUP(E91,'[1]Combined AA and BB'!$A$1:$C$6133,3,FALSE)","v":"Y"}]
[null,null,null,null,11623,550.745,{"$f":"VLOOKUP(E92,'[1]Combined AA and BB'!$A$1:$C$6133,3,FALSE)","v":"Y"}]
[null,null,null,null,11624,1062.8859418079082,{"$f":"VLOOKUP(E93,'[1]Combined AA and BB'!$A$1:$C$6133,3,FALSE)","v":"Y"}]
[null,null,null,null,11626,1789.2422303467429,{"$f":"VLOOKUP(E94,'[1]Combined AA and BB'!$A$1:$C$6133,3,FALSE)","v":"Y"}]
[null,null,null,null,11640,381.65140000000002,{"$f":"VLOOKUP(E95,'[1]Combined AA and BB'!$A$1:$C$6133,3,FALSE)","v":"Y"}]
[null,null,null,null,11641,444.16840000000002,{"$f":"VLOOKUP(E96,'[1]Combined AA and BB'!$A$1:$C$6133,3,FALSE)","v":"Y"}]
[null,null,null,null,11642,500.13600000000002,{"$f":"VLOOKUP(E97,'[1]Combined AA and BB'!$A$1:$C$6133,3,FALSE)","v":"Y"}]
[null,null,null,null,11643,585.27819999999997,{"$f":"VLOOKUP(E98,'[1]Combined AA and BB'!$A$1:$C$6133,3,FALSE)","v":"Y"}]
[null,null,null,null,11644,1062.8859418079082,{"$f":"VLOOKUP(E99,'[1]Combined AA and BB'!$A$1:$C$6133,3,FALSE)","v":"Y"}]
[null,null,null,null,11646,1789.2422303467429,{"$f":"VLOOKUP(E100,'[1]Combined AA and BB'!$A$1:$C$6133,3,FALSE)","v":"Y"}]
[null,null,null,null,11719,"Bundled","NA"]
[null,null,null,null,11720,"Bundled","NA"]
[null,null,null,null,11721,"Bundled","NA"]
[null,null,null,null,11730,"Bundled","NA"]
[null,null,null,null,11732,"Bundled","NA"]
[null,null,null,null,11740,"Bundled","NA"]
[null,null,null,null,11750,297.7,{"$f":"VLOOKUP(E107,'[1]Combined AA and BB'!$A$1:$C$6133,3,FALSE)","v":"Y"}]
[null,null,null,null,11755,229.22900000000001,{"$f":"VLOOKUP(E108,'[1]Combined AA and BB'!$A$1:$C$6133,3,FALSE)","v":"Y"}]
[null,null,null,null,11760,350.69059999999996,{"$f":"VLOOKUP(E109,'[1]Combined AA and BB'!$A$1:$C$6133,3,FALSE)","v":"Y"}]
[null,null,null,null,11762,536.45539999999994,{"$f":"VLOOKUP(E110,'[1]Combined AA and BB'!$A$1:$C$6133,3,FALSE)","v":"Y"}]
[null,null,null,null,11765,"Bundled","NA"]
[null,null,null,null,11770,1789.2422303467429,{"$f":"VLOOKUP(E112,'[1]Combined AA and BB'!$A$1:$C$6133,3,FALSE)","v":"Y"}]
[null,null,null,null,11771,1789.2422303467429,{"$f":"VLOOKUP(E113,'[1]Combined AA and BB'!$A$1:$C$6133,3,FALSE)","v":"Y"}]
[null,null,null,null,11772,1789.2422303467429,{"$f":"VLOOKUP(E114,'[1]Combined AA and BB'!$A$1:$C$6133,3,FALSE)","v":"Y"}]
[null,null,null,null,11900,"Bundled","NA"]
[null,null,null,null,11901,"Bundled","NA"]
[null,null,null,null,11920,359.6216,{"$f":"VLOOKUP(E117,'[1]Combined AA and BB'!$A$1:$C$6133,3,FALSE)","v":"Y"}]
[null,null,null,null,11921,417.37539999999996,{"$f":"VLOOKUP(E118,'[1]Combined AA and BB'!$A$1:$C$6133,3,FALSE)","v":"Y"}]
[null,null,null,null,11922,"Bundled","NA"]
[null,null,null,null,11950,151.23159999999999,{"$f":"VLOOKUP(E120,'[1]Combined AA and BB'!$A$1:$C$6133,3,FALSE)","v":"Y"}]
[null,null,null,null,11951,199.459,{"$f":"VLOOKUP(E121,'[1]Combined AA and BB'!$A$1:$C$6133,3,FALSE)","v":"Y"}]
[null,null,null,null,11952,266.1438,{"$f":"VLOOKUP(E122,'[1]Combined AA and BB'!$A$1:$C$6133,3,FALSE)","v":"Y"}]
[null,null,null,null,11954,292.93680000000001,{"$f":"VLOOKUP(E123,'[1]Combined AA and BB'!$A$1:$C$6133,3,FALSE)","v":"Y"}]
[null,null,null,null,11960,2825.7867811155184,{"$f":"VLOOKUP(E124,'[1]Combined AA and BB'!$A$1:$C$6133,3,FALSE)","v":"Y"}]
[null,null,null,null,11970,8854.0515688595315,{"$f":"VLOOKUP(E125,'[1]Combined AA and BB'!$A$1:$C$6133,3,FALSE)","v":"Y"}]
[null,null,null,null,11971,1789.2422303467429,{"$f":"VLOOKUP(E126,'[1]Combined AA and BB'!$A$1:$C$6133,3,FALSE)","v":"N"}]
[null,null,null,null,11976,"Not covered","NA"]
[null,null,null,null,11980,"Not covered","NA"]
[null,null,null,null,11981,"Bundled","NA"]
[null,null,null,null,11982,"Bundled","NA"]
[null,null,null,null,11983,"Bundled","NA"]
[null,null,null,null,12001,"Bundled","NA"]
[null,null,null,null,12002,"Bundled","NA"]
[null,null,null,null,12004,"Bundled","NA"]
[null,null,null,null,12005,324.06399005482393,{"$f":"VLOOKUP(E135,'[1]Combined AA and BB'!$A$1:$C$6133,3,FALSE)","v":"N"}]
[null,null,null,null,12006,324.06399005482393,{"$f":"VLOOKUP(E136,'[1]Combined AA and BB'!$A$1:$C$6133,3,FALSE)","v":"N"}]
[null,null,null,null,12007,156.86319990561176,{"$f":"VLOOKUP(E137,'[1]Combined AA and BB'!$A$1:$C$6133,3,FALSE)","v":"Y"}]
[null,null,null,null,12011,"Bundled","NA"]
[null,null,null,null,12013,"Bundled","NA"]
[null,null,null,null,12014,"Bundled","NA"]
[null,null,null,null,12015,156.86319990561176,{"$f":"VLOOKUP(E141,'[1]Combined AA and BB'!$A$1:$C$6133,3,FALSE)","v":"N"}]
[null,null,null,null,12016,324.06399005482393,{"$f":"VLOOKUP(E142,'[1]Combined AA and BB'!$A$1:$C$6133,3,FALSE)","v":"N"}]
[null,null,null,null,12017,324.06399005482393,{"$f":"VLOOKUP(E143,'[1]Combined AA and BB'!$A$1:$C$6133,3,FALSE)","v":"N"}]
[null,null,null,null,12018,156.86319990561176,{"$f":"VLOOKUP(E144,'[1]Combined AA and BB'!$A$1:$C$6133,3,FALSE)","v":"N"}]
[null,null,null,null,12020,504.64741795035388,{"$f":"VLOOKUP(E145,'[1]Combined AA and BB'!$A$1:$C$6133,3,FALSE)","v":"Y"}]
[null,null,null,null,12021,324.06399005482393,{"$f":"VLOOKUP(E146,'[1]Combined AA and BB'!$A$1:$C$6133,3,FALSE)","v":"Y"}]
[null,null,null,null,12031,497.15899999999999,{"$f":"VLOOKUP(E147,'[1]Combined AA and BB'!$A$1:$C$6133,3,FALSE)","v":"Y"}]
[null,null,null,null,12032,324.06399005482393,{"$f":"VLOOKUP(E148,'[1]Combined AA and BB'!$A$1:$C$6133,3,FALSE)","v":"Y"}]
[null,null,null,null,12034,324.06399005482393,{"$f":"VLOOKUP(E149,'[1]Combined AA and BB'!$A$1:$C$6133,3,FALSE)","v":"Y"}]
[null,null,null,null,12035,324.06399005482393,{"$f":"VLOOKUP(E150,'[1]Combined AA and BB'!$A$1:$C$6133,3,FALSE)","v":"Y"}]
[null,null,null,null,12036,504.64741795035388,{"$f":"VLOOKUP(E151,'[1]Combined AA and BB'!$A$1:$C$6133,3,FALSE)","v":"Y"}]
[null,null,null,null,12037,1499.1841543066416,{"$f":"VLOOKUP(E152,'[1]Combined AA and BB'!$A$1:$C$6133,3,FALSE)","v":"Y"}]
[null,null,null,null,12041,498.34979999999996,{"$f":"VLOOKUP(E153,'[1]Combined AA and BB'!$A$1:$C$6133,3,FALSE)","v":"N"}]
[null,null,null,null,12042,324.06399005482393,{"$f":"VLOOKUP(E154,'[1]Combined AA and BB'!$A$1:$C$6133,3,FALSE)","v":"Y"}]
[null,null,null,null,12044,504.64741795035388,{"$f":"VLOOKUP(E155,'[1]Combined AA and BB'!$A$1:$C$6133,3,FALSE)","v":"Y"}]
[null,null,null,null,12045,504.64741795035388,{"$f":"VLOOKUP(E156,'[1]Combined AA and BB'!$A$1:$C$6133,3,FALSE)","v":"Y"}]
[null,null,null,null,12046,504.64741795035388,{"$f":"VLOOKUP(E157,'[1]Combined AA and BB'!$A$1:$C$6133,3,FALSE)","v":"Y"}]
[null,null,null,null,12047,1499.1841543066416,{"$f":"VLOOKUP(E158,'[1]Combined AA and BB'!$A$1:$C$6133,3,FALSE)","v":"Y"}]
[null,null,null,null,12051,324.06399005482393,{"$f":"VLOOKUP(E159,'[1]Combined AA and BB'!$A$1:$C$6133,3,FALSE)","v":"Y"}]
[null,null,null,null,12052,324.06399005482393,{"$f":"VLOOKUP(E160,'[1]Combined AA and BB'!$A$1:$C$6133,3,FALSE)","v":"Y"}]
[null,null,null,null,12053,324.06399005482393,{"$f":"VLOOKUP(E161,'[1]Combined AA and BB'!$A$1:$C$6133,3,FALSE)","v":"Y"}]
[null,null,null,null,12054,324.06399005482393,{"$f":"VLOOKUP(E162,'[1]Combined AA and BB'!$A$1:$C$6133,3,FALSE)","v":"N"}]
[null,null,null,null,12055,324.06399005482393,{"$f":"VLOOKUP(E163,'[1]Combined AA and BB'!$A$1:$C$6133,3,FALSE)","v":"Y"}]
[null,null,null,null,12056,324.06399005482393,{"$f":"VLOOKUP(E164,'[1]Combined AA and BB'!$A$1:$C$6133,3,FALSE)","v":"N"}]
[null,null,null,null,12057,324.06399005482393,{"$f":"VLOOKUP(E165,'[1]Combined AA and BB'!$A$1:$C$6133,3,FALSE)","v":"Y"}]
[null,null,null,null,13100,504.64741795035388,{"$f":"VLOOKUP(E166,'[1]Combined AA and BB'!$A$1:$C$6133,3,FALSE)","v":"Y"}]
[null,null,null,null,13101,504.64741795035388,{"$f":"VLOOKUP(E167,'[1]Combined AA and BB'!$A$1:$C$6133,3,FALSE)","v":"Y"}]
[null,null,null,null,13102,"Bundled","NA"]
[null,null,null,null,13120,504.64741795035388,{"$f":"VLOOKUP(E169,'[1]Combined AA and BB'!$A$1:$C$6133,3,FALSE)","v":"Y"}]
[null,null,null,null,13121,504.64741795035388,{"$f":"VLOOKUP(E170,'[1]Combined AA and BB'!$A$1:$C$6133,3,FALSE)","v":"Y"}]
[null,null,null,null,13122,"Bundled","NA"]
[null,null,null,null,13131,324.06399005482393,{"$f":"VLOOKUP(E172,'[1]Combined AA and BB'!$A$1:$C$6133,3,FALSE)","v":"Y"}]
[null,null,null,null,13132,504.64741795035388,{"$f":"VLOOKUP(E173,'[1]Combined AA and BB'!$A$1:$C$6133,3,FALSE)","v":"Y"}]
[null,null,null,null,13133,"Bundled","NA"]
[null,null,null,null,13151,504.64741795035388,{"$f":"VLOOKUP(E175,'[1]Combined AA and BB'!$A$1:$C$6133,3,FALSE)","v":"Y"}]
[null,null,null,null,13152,504.64741795035388,{"$f":"VLOOKUP(E176,'[1]Combined AA and BB'!$A$1:$C$6133,3,FALSE)","v":"Y"}]
[null,null,null,null,13153,"Bundled","NA"]
[null,null,null,null,13160,1499.1841543066416,{"$f":"VLOOKUP(E178,'[1]Combined AA and BB'!$A$1:$C$6133,3,FALSE)","v":"Y"}]
[null,null,null,null,14000,1499.1841543066416,{"$f":"VLOOKUP(E179,'[1]Combined AA and BB'!$A$1:$C$6133,3,FALSE)","v":"Y"}]
[null,null,null,null,14001,1499.1841543066416,{"$f":"VLOOKUP(E180,'[1]Combined AA and BB'!$A$1:$C$6133,3,FALSE)","v":"Y"}]
[null,null,null,null,14020,1499.1841543066416,{"$f":"VLOOKUP(E181,'[1]Combined AA and BB'!$A$1:$C$6133,3,FALSE)","v":"Y"}]
[null,null,null,null,14021,1499.1841543066416,{"$f":"VLOOKUP(E182,'[1]Combined AA and BB'!$A$1:$C$6133,3,FALSE)","v":"Y"}]
[null,null,null,null,14040,1499.1841543066416,{"$f":"VLOOKUP(E183,'[1]Combined AA and BB'!$A$1:$C$6133,3,FALSE)","v":"Y"}]
[null,null,null,null,14041,1499.1841543066416,{"$f":"VLOOKUP(E184,'[1]Combined AA and BB'!$A$1:$C$6133,3,FALSE)","v":"Y"}]
[null,null,null,null,14060,1499.1841543066416,{"$f":"VLOOKUP(E185,'[1]Combined AA and BB'!$A$1:$C$6133,3,FALSE)","v":"Y"}]
[null,null,null,null,14061,1499.1841543066416,{"$f":"VLOOKUP(E186,'[1]Combined AA and BB'!$A$1:$C$6133,3,FALSE)","v":"Y"}]
[null,null,null,null,14301,2825.7867811155184,{"$f":"VLOOKUP(E187,'[1]Combined AA and BB'!$A$1:$C$6133,3,FALSE)","v":"Y"}]
[null,null,null,null,14302,"Bundled","NA"]
[null,null,null,null,14350,1499.1841543066416,{"$f":"VLOOKUP(E189,'[1]Combined AA and BB'!$A$1:$C$6133,3,FALSE)","v":"Y"}]
[null,null,null,null,15002,1499.1841543066416,{"$f":"VLOOKUP(E190,'[1]Combined AA and BB'!$A$1:$C$6133,3,FALSE)","v":"Y"}]
[null,null,null,null,15003,"Bundled","NA"]
[null,null,null,null,15004,504.64741795035388,{"$f":"VLOOKUP(E192,'[1]Combined AA and BB'!$A$1:$C$6133,3,FALSE)","v":"Y"}]
[null,null,null,null,15005,"Bundled","NA"]
[null,null,null,null,15040,1499.1841543066416,{"$f":"VLOOKUP(E194,'[1]Combined AA and BB'!$A$1:$C$6133,3,FALSE)","v":"Y"}]
[null,null,null,null,15050,504.64741795035388,{"$f":"VLOOKUP(E195,'[1]Combined AA and BB'!$A$1:$C$6133,3,FALSE)","v":"Y"}]
[null,null,null,null,15100,1499.1841543066416,{"$f":"VLOOKUP(E196,'[1]Combined AA and BB'!$A$1:$C$6133,3,FALSE)","v":"Y"}]
[null,null,null,null,15101,"Bundled","NA"]
[null,null,null,null,15110,1499.1841543066416,{"$f":"VLOOKUP(E198,'[1]Combined AA and BB'!$A$1:$C$6133,3,FALSE)","v":"Y"}]
[null,null,null,null,15111,"Bundled","NA"]
[null,null,null,null,15115,1499.1841543066416,{"$f":"VLOOKUP(E200,'[1]Combined AA and BB'!$A$1:$C$6133,3,FALSE)","v":"Y"}]
[null,null,null,null,15116,"Bundled","NA"]
[null,null,null,null,15120,2825.7867811155184,{"$f":"VLOOKUP(E202,'[1]Combined AA and BB'!$A$1:$C$6133,3,FALSE)","v":"Y"}]
[null,null,null,null,15121,"Bundled","NA"]
[null,null,null,null,15130,1499.1841543066416,{"$f":"VLOOKUP(E204,'[1]Combined AA and BB'!$A$1:$C$6133,3,FALSE)","v":"Y"}]
[null,null,null,null,15131,"Bundled","NA"]
[null,null,null,null,15135,2825.7867811155184,{"$f":"VLOOKUP(E206,'[1]Combined AA and BB'!$A$1:$C$6133,3,FALSE)","v":"Y"}]
[null,null,null,null,15136,"Bundled","NA"]
[null,null,null,null,15150,1499.1841543066416,{"$f":"VLOOKUP(E208,'[1]Combined AA and BB'!$A$1:$C$6133,3,FALSE)","v":"Y"}]
[null,null,null,null,15151,"Bundled","NA"]
[null,null,null,null,15152,"Bundled","NA"]
[null,null,null,null,15155,2825.7867811155184,{"$f":"VLOOKUP(E211,'[1]Combined AA and BB'!$A$1:$C$6133,3,FALSE)","v":"Y"}]
[null,null,null,null,15156,"Bundled","NA"]
[null,null,null,null,15157,"Bundled","NA"]
[null,null,null,null,15200,1499.1841543066416,{"$f":"VLOOKUP(E214,'[1]Combined AA and BB'!$A$1:$C$6133,3,FALSE)","v":"Y"}]
[null,null,null,null,15201,"Bundled","NA"]
[null,null,null,null,15220,1499.1841543066416,{"$f":"VLOOKUP(E216,'[1]Combined AA and BB'!$A$1:$C$6133,3,FALSE)","v":"Y"}]
[null,null,null,null,15221,"Bundled","NA"]
[null,null,null,null,15240,1499.1841543066416,{"$f":"VLOOKUP(E218,'[1]Combined AA and BB'!$A$1:$C$6133,3,FALSE)","v":"Y"}]
[null,null,null,null,15241,"Bundled","NA"]
[null,null,null,null,15260,1499.1841543066416,{"$f":"VLOOKUP(E220,'[1]Combined AA and BB'!$A$1:$C$6133,3,FALSE)","v":"Y"}]
[null,null,null,null,15261,"Bundled","NA"]
[null,null,null,null,15271,1499.1841543066416,{"$f":"VLOOKUP(E222,'[1]Combined AA and BB'!$A$1:$C$6133,3,FALSE)","v":"Y"}]
[null,null,null,null,15272,"Bundled","NA"]
[null,null,null,null,15273,2825.7867811155184,{"$f":"VLOOKUP(E224,'[1]Combined AA and BB'!$A$1:$C$6133,3,FALSE)","v":"Y"}]
[null,null,null,null,15274,"Bundled","NA"]
[null,null,null,null,15275,294.12760000000003,{"$f":"VLOOKUP(E226,'[1]Combined AA and BB'!$A$1:$C$6133,3,FALSE)","v":"Y"}]
[null,null,null,null,15276,"Bundled","NA"]
[null,null,null,null,15277,1499.1841543066416,{"$f":"VLOOKUP(E228,'[1]Combined AA and BB'!$A$1:$C$6133,3,FALSE)","v":"Y"}]
[null,null,null,null,15278,"Bundled","NA"]
[null,null,null,null,15570,1499.1841543066416,{"$f":"VLOOKUP(E230,'[1]Combined AA and BB'!$A$1:$C$6133,3,FALSE)","v":"Y"}]
[null,null,null,null,15572,2825.7867811155184,{"$f":"VLOOKUP(E231,'[1]Combined AA and BB'!$A$1:$C$6133,3,FALSE)","v":"Y"}]
[null,null,null,null,15574,1499.1841543066416,{"$f":"VLOOKUP(E232,'[1]Combined AA and BB'!$A$1:$C$6133,3,FALSE)","v":"Y"}]
[null,null,null,null,15576,1499.1841543066416,{"$f":"VLOOKUP(E233,'[1]Combined AA and BB'!$A$1:$C$6133,3,FALSE)","v":"Y"}]
[null,null,null,null,15600,2825.7867811155184,{"$f":"VLOOKUP(E234,'[1]Combined AA and BB'!$A$1:$C$6133,3,FALSE)","v":"Y"}]
[null,null,null,null,15610,1499.1841543066416,{"$f":"VLOOKUP(E235,'[1]Combined AA and BB'!$A$1:$C$6133,3,FALSE)","v":"Y"}]
[null,null,null,null,15620,1499.1841543066416,{"$f":"VLOOKUP(E236,'[1]Combined AA and BB'!$A$1:$C$6133,3,FALSE)","v":"Y"}]
[null,null,null,null,15630,1499.1841543066416,{"$f":"VLOOKUP(E237,'[1]Combined AA and BB'!$A$1:$C$6133,3,FALSE)","v":"Y"}]
[null,null,null,null,15650,1499.1841543066416,{"$f":"VLOOKUP(E238,'[1]Combined AA and BB'!$A$1:$C$6133,3,FALSE)","v":"Y"}]
[null,null,null,null,15730,2825.7867811155184,{"$f":"VLOOKUP(E239,'[1]Combined AA and BB'!$A$1:$C$6133,3,FALSE)","v":"Y"}]
[null,null,null,null,15731,2825.7867811155184,{"$f":"VLOOKUP(E240,'[1]Combined AA and BB'!$A$1:$C$6133,3,FALSE)","v":"Y"}]
[null,null,null,null,15733,2825.7867811155184,{"$f":"VLOOKUP(E241,'[1]Combined AA and BB'!$A$1:$C$6133,3,FALSE)","v":"Y"}]
[null,null,null,null,15734,2825.7867811155184,{"$f":"VLOOKUP(E242,'[1]Combined AA and BB'!$A$1:$C$6133,3,FALSE)","v":"Y"}]
[null,null,null,null,15736,1499.1841543066416,{"$f":"VLOOKUP(E243,'[1]Combined AA and BB'!$A$1:$C$6133,3,FALSE)","v":"Y"}]
[null,null,null,null,15738,2825.7867811155184,{"$f":"VLOOKUP(E244,'[1]Combined AA and BB'!$A$1:$C$6133,3,FALSE)","v":"Y"}]
[null,null,null,null,15740,1499.1841543066416,{"$f":"VLOOKUP(E245,'[1]Combined AA and BB'!$A$1:$C$6133,3,FALSE)","v":"Y"}]
[null,null,null,null,15750,2825.7867811155184,{"$f":"VLOOKUP(E246,'[1]Combined AA and BB'!$A$1:$C$6133,3,FALSE)","v":"Y"}]
[null,null,null,null,15760,1499.1841543066416,{"$f":"VLOOKUP(E247,'[1]Combined AA and BB'!$A$1:$C$6133,3,FALSE)","v":"Y"}]
[null,null,null,null,15769,2825.7867811155184,{"$f":"VLOOKUP(E248,'[1]Combined AA and BB'!$A$1:$C$6133,3,FALSE)","v":"Y"}]
[null,null,null,null,15770,2825.7867811155184,{"$f":"VLOOKUP(E249,'[1]Combined AA and BB'!$A$1:$C$6133,3,FALSE)","v":"Y"}]
[null,null,null,null,15771,"Not covered","NA"]
[null,null,null,null,15773,"Not covered","NA"]
[null,null,null,null,15775,324.06399005482393,{"$f":"VLOOKUP(E252,'[1]Combined AA and BB'!$A$1:$C$6133,3,FALSE)","v":"Y"}]
[null,null,null,null,15776,324.06399005482393,{"$f":"VLOOKUP(E253,'[1]Combined AA and BB'!$A$1:$C$6133,3,FALSE)","v":"Y"}]
[null,null,null,null,15777,"Bundled","NA"]
[null,null,null,null,15780,1576.0237999999999,{"$f":"VLOOKUP(E255,'[1]Combined AA and BB'!$A$1:$C$6133,3,FALSE)","v":"Y"}]
[null,null,null,null,15781,563.74037104996432,{"$f":"VLOOKUP(E256,'[1]Combined AA and BB'!$A$1:$C$6133,3,FALSE)","v":"Y"}]
[null,null,null,null,15782,907.98500000000001,{"$f":"VLOOKUP(E257,'[1]Combined AA and BB'!$A$1:$C$6133,3,FALSE)","v":"Y"}]
[null,null,null,null,15783,324.06399005482393,{"$f":"VLOOKUP(E258,'[1]Combined AA and BB'!$A$1:$C$6133,3,FALSE)","v":"Y"}]
[null,null,null,null,15786,"Bundled","NA"]
[null,null,null,null,15787,"Bundled","NA"]
[null,null,null,null,15788,"Not covered","NA"]
[null,null,null,null,15789,"Not covered","NA"]
[null,null,null,null,15792,"Not covered","NA"]
[null,null,null,null,15793,"Not covered","NA"]
[null,null,null,null,15819,"Not covered","NA"]
[null,null,null,null,15820,1499.1841543066416,{"$f":"VLOOKUP(E266,'[1]Combined AA and BB'!$A$1:$C$6133,3,FALSE)","v":"Y"}]
[null,null,null,null,15821,1499.1841543066416,{"$f":"VLOOKUP(E267,'[1]Combined AA and BB'!$A$1:$C$6133,3,FALSE)","v":"Y"}]
[null,null,null,null,15822,1499.1841543066416,{"$f":"VLOOKUP(E268,'[1]Combined AA and BB'!$A$1:$C$6133,3,FALSE)","v":"Y"}]
[null,null,null,null,15823,1499.1841543066416,{"$f":"VLOOKUP(E269,'[1]Combined AA and BB'!$A$1:$C$6133,3,FALSE)","v":"Y"}]
[null,null,null,null,15824,1499.1841543066416,{"$f":"VLOOKUP(E270,'[1]Combined AA and BB'!$A$1:$C$6133,3,FALSE)","v":"Y"}]
[null,null,null,null,15825,2825.7867811155184,{"$f":"VLOOKUP(E271,'[1]Combined AA and BB'!$A$1:$C$6133,3,FALSE)","v":"Y"}]
[null,null,null,null,15826,2825.7867811155184,{"$f":"VLOOKUP(E272,'[1]Combined AA and BB'!$A$1:$C$6133,3,FALSE)","v":"Y"}]
[null,null,null,null,15828,2825.7867811155184,{"$f":"VLOOKUP(E273,'[1]Combined AA and BB'!$A$1:$C$6133,3,FALSE)","v":"Y"}]
[null,null,null,null,15829,2825.7867811155184,{"$f":"VLOOKUP(E274,'[1]Combined AA and BB'!$A$1:$C$6133,3,FALSE)","v":"Y"}]
[null,null,null,null,15830,4019.3242923368975,{"$f":"VLOOKUP(E275,'[1]Combined AA and BB'!$A$1:$C$6133,3,FALSE)","v":"Y"}]
[null,null,null,null,15832,1789.2422303467429,{"$f":"VLOOKUP(E276,'[1]Combined AA and BB'!$A$1:$C$6133,3,FALSE)","v":"Y"}]
[null,null,null,null,15833,1789.2422303467429,{"$f":"VLOOKUP(E277,'[1]Combined AA and BB'!$A$1:$C$6133,3,FALSE)","v":"Y"}]
[null,null,null,null,15834,1789.2422303467429,{"$f":"VLOOKUP(E278,'[1]Combined AA and BB'!$A$1:$C$6133,3,FALSE)","v":"Y"}]
[null,null,null,null,15835,1789.2422303467429,{"$f":"VLOOKUP(E279,'[1]Combined AA and BB'!$A$1:$C$6133,3,FALSE)","v":"Y"}]
[null,null,null,null,15836,1789.2422303467429,{"$f":"VLOOKUP(E280,'[1]Combined AA and BB'!$A$1:$C$6133,3,FALSE)","v":"Y"}]
[null,null,null,null,15837,1789.2422303467429,{"$f":"VLOOKUP(E281,'[1]Combined AA and BB'!$A$1:$C$6133,3,FALSE)","v":"Y"}]
[null,null,null,null,15838,1789.2422303467429,{"$f":"VLOOKUP(E282,'[1]Combined AA and BB'!$A$1:$C$6133,3,FALSE)","v":"Y"}]
[null,null,null,null,15839,1789.2422303467429,{"$f":"VLOOKUP(E283,'[1]Combined AA and BB'!$A$1:$C$6133,3,FALSE)","v":"Y"}]
[null,null,null,null,15840,2825.7867811155184,{"$f":"VLOOKUP(E284,'[1]Combined AA and BB'!$A$1:$C$6133,3,FALSE)","v":"Y"}]
[null,null,null,null,15841,2825.7867811155184,{"$f":"VLOOKUP(E285,'[1]Combined AA and BB'!$A$1:$C$6133,3,FALSE)","v":"Y"}]
[null,null,null,null,15842,1499.1841543066416,{"$f":"VLOOKUP(E286,'[1]Combined AA and BB'!$A$1:$C$6133,3,FALSE)","v":"Y"}]
[null,null,null,null,15845,2825.7867811155184,{"$f":"VLOOKUP(E287,'[1]Combined AA and BB'!$A$1:$C$6133,3,FALSE)","v":"Y"}]
[null,null,null,null,15847,"Bundled","NA"]
[null,null,null,null,15851,102.4088,{"$f":"VLOOKUP(E289,'[1]Combined AA and BB'!$A$1:$C$6133,3,FALSE)","v":"Y"}]
[null,null,null,null,15852,"Bundled","NA"]
[null,null,null,null,15860,"Bundled","NA"]
[null,null,null,null,15876,"Not covered","NA"]
[null,null,null,null,15877,"Not covered","NA"]
[null,null,null,null,15878,"Not covered","NA"]
[null,null,null,null,15879,"Not covered","NA"]
[null,null,null,null,15920,1789.2422303467429,{"$f":"VLOOKUP(E296,'[1]Combined AA and BB'!$A$1:$C$6133,3,FALSE)","v":"Y"}]
[null,null,null,null,15922,2825.7867811155184,{"$f":"VLOOKUP(E297,'[1]Combined AA and BB'!$A$1:$C$6133,3,FALSE)","v":"Y"}]
[null,null,null,null,15931,1789.2422303467429,{"$f":"VLOOKUP(E298,'[1]Combined AA and BB'!$A$1:$C$6133,3,FALSE)","v":"Y"}]
[null,null,null,null,15933,1789.2422303467429,{"$f":"VLOOKUP(E299,'[1]Combined AA and BB'!$A$1:$C$6133,3,FALSE)","v":"Y"}]
[null,null,null,null,15934,2825.7867811155184,{"$f":"VLOOKUP(E300,'[1]Combined AA and BB'!$A$1:$C$6133,3,FALSE)","v":"Y"}]
[null,null,null,null,15935,2825.7867811155184,{"$f":"VLOOKUP(E301,'[1]Combined AA and BB'!$A$1:$C$6133,3,FALSE)","v":"Y"}]
[null,null,null,null,15936,1499.1841543066416,{"$f":"VLOOKUP(E302,'[1]Combined AA and BB'!$A$1:$C$6133,3,FALSE)","v":"Y"}]
[null,null,null,null,15937,1499.1841543066416,{"$f":"VLOOKUP(E303,'[1]Combined AA and BB'!$A$1:$C$6133,3,FALSE)","v":"Y"}]
[null,null,null,null,15940,1789.2422303467429,{"$f":"VLOOKUP(E304,'[1]Combined AA and BB'!$A$1:$C$6133,3,FALSE)","v":"Y"}]
[null,null,null,null,15941,1789.2422303467429,{"$f":"VLOOKUP(E305,'[1]Combined AA and BB'!$A$1:$C$6133,3,FALSE)","v":"Y"}]
[null,null,null,null,15944,2825.7867811155184,{"$f":"VLOOKUP(E306,'[1]Combined AA and BB'!$A$1:$C$6133,3,FALSE)","v":"Y"}]
[null,null,null,null,15945,1499.1841543066416,{"$f":"VLOOKUP(E307,'[1]Combined AA and BB'!$A$1:$C$6133,3,FALSE)","v":"Y"}]
[null,null,null,null,15946,1499.1841543066416,{"$f":"VLOOKUP(E308,'[1]Combined AA and BB'!$A$1:$C$6133,3,FALSE)","v":"Y"}]
[null,null,null,null,15950,1062.8859418079082,{"$f":"VLOOKUP(E309,'[1]Combined AA and BB'!$A$1:$C$6133,3,FALSE)","v":"Y"}]
[null,null,null,null,15951,1789.2422303467429,{"$f":"VLOOKUP(E310,'[1]Combined AA and BB'!$A$1:$C$6133,3,FALSE)","v":"Y"}]
[null,null,null,null,15952,1499.1841543066416,{"$f":"VLOOKUP(E311,'[1]Combined AA and BB'!$A$1:$C$6133,3,FALSE)","v":"Y"}]
[null,null,null,null,15953,2825.7867811155184,{"$f":"VLOOKUP(E312,'[1]Combined AA and BB'!$A$1:$C$6133,3,FALSE)","v":"Y"}]
[null,null,null,null,15956,1499.1841543066416,{"$f":"VLOOKUP(E313,'[1]Combined AA and BB'!$A$1:$C$6133,3,FALSE)","v":"Y"}]
[null,null,null,null,15958,2825.7867811155184,{"$f":"VLOOKUP(E314,'[1]Combined AA and BB'!$A$1:$C$6133,3,FALSE)","v":"Y"}]
[null,null,null,null,16000,"Bundled","NA"]
[null,null,null,null,16020,"Bundled","NA"]
[null,null,null,null,16025,156.86319990561176,{"$f":"VLOOKUP(E317,'[1]Combined AA and BB'!$A$1:$C$6133,3,FALSE)","v":"Y"}]
[null,null,null,null,16030,324.06399005482393,{"$f":"VLOOKUP(E318,'[1]Combined AA and BB'!$A$1:$C$6133,3,FALSE)","v":"Y"}]
[null,null,null,null,16035,324.06399005482393,{"$f":"VLOOKUP(E319,'[1]Combined AA and BB'!$A$1:$C$6133,3,FALSE)","v":"Y"}]
[null,null,null,null,17000,"Bundled","NA"]
[null,null,null,null,17003,"Bundled","NA"]
[null,null,null,null,17004,317.34820000000002,{"$f":"VLOOKUP(E322,'[1]Combined AA and BB'!$A$1:$C$6133,3,FALSE)","v":"Y"}]
[null,null,null,null,17106,324.06399005482393,{"$f":"VLOOKUP(E323,'[1]Combined AA and BB'!$A$1:$C$6133,3,FALSE)","v":"Y"}]
[null,null,null,null,17107,827.60599999999999,{"$f":"VLOOKUP(E324,'[1]Combined AA and BB'!$A$1:$C$6133,3,FALSE)","v":"Y"}]
[null,null,null,null,17108,1167.5793999999999,{"$f":"VLOOKUP(E325,'[1]Combined AA and BB'!$A$1:$C$6133,3,FALSE)","v":"Y"}]
[null,null,null,null,17110,"Bundled","NA"]
[null,null,null,null,17111,"Bundled","NA"]
[null,null,null,null,17250,"Bundled","NA"]
[null,null,null,null,17260,"Bundled","NA"]
[null,null,null,null,17261,"Bundled","NA"]
[null,null,null,null,17262,"Bundled","NA"]
[null,null,null,null,17263,"Bundled","NA"]
[null,null,null,null,17264,387.01,{"$f":"VLOOKUP(E333,'[1]Combined AA and BB'!$A$1:$C$6133,3,FALSE)","v":"Y"}]
[null,null,null,null,17266,440.00059999999996,{"$f":"VLOOKUP(E334,'[1]Combined AA and BB'!$A$1:$C$6133,3,FALSE)","v":"Y"}]
[null,null,null,null,17270,156.86319990561176,{"$f":"VLOOKUP(E335,'[1]Combined AA and BB'!$A$1:$C$6133,3,FALSE)","v":"Y"}]
[null,null,null,null,17271,156.86319990561176,{"$f":"VLOOKUP(E336,'[1]Combined AA and BB'!$A$1:$C$6133,3,FALSE)","v":"Y"}]
[null,null,null,null,17272,"Bundled","NA"]
[null,null,null,null,17273,390.58239999999995,{"$f":"VLOOKUP(E338,'[1]Combined AA and BB'!$A$1:$C$6133,3,FALSE)","v":"Y"}]
[null,null,null,null,17274,456.07639999999998,{"$f":"VLOOKUP(E339,'[1]Combined AA and BB'!$A$1:$C$6133,3,FALSE)","v":"Y"}]
[null,null,null,null,17276,528.11979999999994,{"$f":"VLOOKUP(E340,'[1]Combined AA and BB'!$A$1:$C$6133,3,FALSE)","v":"Y"}]
[null,null,null,null,17280,"Bundled","NA"]
[null,null,null,null,17281,336.40100000000001,{"$f":"VLOOKUP(E342,'[1]Combined AA and BB'!$A$1:$C$6133,3,FALSE)","v":"Y"}]
[null,null,null,null,17282,384.03300000000002,{"$f":"VLOOKUP(E343,'[1]Combined AA and BB'!$A$1:$C$6133,3,FALSE)","v":"Y"}]
[null,null,null,null,17283,451.90859999999998,{"$f":"VLOOKUP(E344,'[1]Combined AA and BB'!$A$1:$C$6133,3,FALSE)","v":"Y"}]
[null,null,null,null,17284,513.23479999999995,{"$f":"VLOOKUP(E345,'[1]Combined AA and BB'!$A$1:$C$6133,3,FALSE)","v":"Y"}]
[null,null,null,null,17286,653.74919999999997,{"$f":"VLOOKUP(E346,'[1]Combined AA and BB'!$A$1:$C$6133,3,FALSE)","v":"Y"}]
[null,null,null,null,17311,504.64741795035388,{"$f":"VLOOKUP(E347,'[1]Combined AA and BB'!$A$1:$C$6133,3,FALSE)","v":"Y"}]
[null,null,null,null,17312,"Bundled","NA"]
[null,null,null,null,17313,504.64741795035388,{"$f":"VLOOKUP(E349,'[1]Combined AA and BB'!$A$1:$C$6133,3,FALSE)","v":"Y"}]
[null,null,null,null,17314,"Bundled","NA"]
[null,null,null,null,17315,"Bundled","NA"]
[null,null,null,null,17340,"Not covered","NA"]
[null,null,null,null,17360,"Not covered","NA"]
[null,null,null,null,17380,"Not covered","NA"]
[null,null,null,null,19000,191.1234,{"$f":"VLOOKUP(E355,'[1]Combined AA and BB'!$A$1:$C$6133,3,FALSE)","v":"Y"}]
[null,null,null,null,19001,"Bundled","NA"]
[null,null,null,null,19020,1062.8859418079082,{"$f":"VLOOKUP(E357,'[1]Combined AA and BB'!$A$1:$C$6133,3,FALSE)","v":"Y"}]
[null,null,null,null,19030,"Bundled","NA"]
[null,null,null,null,19081,1062.8859418079082,{"$f":"VLOOKUP(E359,'[1]Combined AA and BB'!$A$1:$C$6133,3,FALSE)","v":"Y"}]
[null,null,null,null,19082,"Bundled","NA"]
[null,null,null,null,19083,1062.8859418079082,{"$f":"VLOOKUP(E361,'[1]Combined AA and BB'!$A$1:$C$6133,3,FALSE)","v":"Y"}]
[null,null,null,null,19084,"Bundled","NA"]
[null,null,null,null,19085,1062.8859418079082,{"$f":"VLOOKUP(E363,'[1]Combined AA and BB'!$A$1:$C$6133,3,FALSE)","v":"Y"}]
[null,null,null,null,19086,"Bundled","NA"]
[null,null,null,null,19100,1062.8859418079082,{"$f":"VLOOKUP(E365,'[1]Combined AA and BB'!$A$1:$C$6133,3,FALSE)","v":"Y"}]
[null,null,null,null,19101,2166.8367713868383,{"$f":"VLOOKUP(E366,'[1]Combined AA and BB'!$A$1:$C$6133,3,FALSE)","v":"Y"}]
[null,null,null,null,19105,"Not covered","NA"]
[null,null,null,null,19110,2166.8367713868383,{"$f":"VLOOKUP(E368,'[1]Combined AA and BB'!$A$1:$C$6133,3,FALSE)","v":"Y"}]
[null,null,null,null,19112,2166.8367713868383,{"$f":"VLOOKUP(E369,'[1]Combined AA and BB'!$A$1:$C$6133,3,FALSE)","v":"Y"}]
[null,null,null,null,19120,2166.8367713868383,{"$f":"VLOOKUP(E370,'[1]Combined AA and BB'!$A$1:$C$6133,3,FALSE)","v":"Y"}]
[null,null,null,null,19125,2166.8367713868383,{"$f":"VLOOKUP(E371,'[1]Combined AA and BB'!$A$1:$C$6133,3,FALSE)","v":"Y"}]
[null,null,null,null,19126,"Bundled","NA"]
[null,null,null,null,19281,"Bundled","NA"]
[null,null,null,null,19282,"Bundled","NA"]
[null,null,null,null,19283,"Bundled","NA"]
[null,null,null,null,19284,"Bundled","NA"]
[null,null,null,null,19285,"Bundled","NA"]
[null,null,null,null,19286,"Bundled","NA"]
[null,null,null,null,19287,"Bundled","NA"]
[null,null,null,null,19288,"Bundled","NA"]
[null,null,null,null,19294,"Bundled","NA"]
[null,null,null,null,19296,"Not covered","NA"]
[null,null,null,null,19297,"Not covered","NA"]
[null,null,null,null,19298,"Not covered","NA"]
[null,null,null,null,19300,"Not covered","NA"]
[null,null,null,null,19301,"Not covered","NA"]
[null,null,null,null,19302,"Not covered","NA"]
[null,null,null,null,19303,"Not covered","NA"]
[null,null,null,null,19316,4019.3242923368975,{"$f":"VLOOKUP(E389,'[1]Combined AA and BB'!$A$1:$C$6133,3,FALSE)","v":"Y"}]
[null,null,null,null,19318,4019.3242923368975,{"$f":"VLOOKUP(E390,'[1]Combined AA and BB'!$A$1:$C$6133,3,FALSE)","v":"Y"}]
[null,null,null,null,19325,4731.5626333631326,{"$f":"VLOOKUP(E391,'[1]Combined AA and BB'!$A$1:$C$6133,3,FALSE)","v":"Y"}]
[null,null,null,null,19328,2166.8367713868383,{"$f":"VLOOKUP(E392,'[1]Combined AA and BB'!$A$1:$C$6133,3,FALSE)","v":"N"}]
[null,null,null,null,19330,2166.8367713868383,{"$f":"VLOOKUP(E393,'[1]Combined AA and BB'!$A$1:$C$6133,3,FALSE)","v":"N"}]
[null,null,null,null,19340,4019.3242923368975,{"$f":"VLOOKUP(E394,'[1]Combined AA and BB'!$A$1:$C$6133,3,FALSE)","v":"Y"}]
[null,null,null,null,19342,4731.5626333631326,{"$f":"VLOOKUP(E395,'[1]Combined AA and BB'!$A$1:$C$6133,3,FALSE)","v":"Y"}]
[null,null,null,null,19350,2166.8367713868383,{"$f":"VLOOKUP(E396,'[1]Combined AA and BB'!$A$1:$C$6133,3,FALSE)","v":"Y"}]
[null,null,null,null,19355,"Not covered","NA"]
[null,null,null,null,19357,11756.282792358237,{"$f":"VLOOKUP(E398,'[1]Combined AA and BB'!$A$1:$C$6133,3,FALSE)","v":"Y"}]
[null,null,null,null,19370,2166.8367713868383,{"$f":"VLOOKUP(E399,'[1]Combined AA and BB'!$A$1:$C$6133,3,FALSE)","v":"Y"}]
[null,null,null,null,19371,2166.8367713868383,{"$f":"VLOOKUP(E400,'[1]Combined AA and BB'!$A$1:$C$6133,3,FALSE)","v":"Y"}]
[null,null,null,null,19380,4019.3242923368975,{"$f":"VLOOKUP(E401,'[1]Combined AA and BB'!$A$1:$C$6133,3,FALSE)","v":"Y"}]
[null,null,null,null,19396,2166.8367713868383,{"$f":"VLOOKUP(E402,'[1]Combined AA and BB'!$A$1:$C$6133,3,FALSE)","v":"Y"}]
[null,null,null,null,20103,1062.8859418079082,{"$f":"VLOOKUP(E403,'[1]Combined AA and BB'!$A$1:$C$6133,3,FALSE)","v":"Y"}]
[null,null,null,null,20150,2360.4308567939793,{"$f":"VLOOKUP(E404,'[1]Combined AA and BB'!$A$1:$C$6133,3,FALSE)","v":"Y"}]
[null,null,null,null,20200,1062.8859418079082,{"$f":"VLOOKUP(E405,'[1]Combined AA and BB'!$A$1:$C$6133,3,FALSE)","v":"Y"}]
[null,null,null,null,20205,1789.2422303467429,{"$f":"VLOOKUP(E406,'[1]Combined AA and BB'!$A$1:$C$6133,3,FALSE)","v":"Y"}]
[null,null,null,null,20206,1062.8859418079082,{"$f":"VLOOKUP(E407,'[1]Combined AA and BB'!$A$1:$C$6133,3,FALSE)","v":"Y"}]
[null,null,null,null,20220,1062.8859418079082,{"$f":"VLOOKUP(E408,'[1]Combined AA and BB'!$A$1:$C$6133,3,FALSE)","v":"Y"}]
[null,null,null,null,20225,1062.8859418079082,{"$f":"VLOOKUP(E409,'[1]Combined AA and BB'!$A$1:$C$6133,3,FALSE)","v":"Y"}]
[null,null,null,null,20240,1789.2422303467429,{"$f":"VLOOKUP(E410,'[1]Combined AA and BB'!$A$1:$C$6133,3,FALSE)","v":"Y"}]
[null,null,null,null,20245,1789.2422303467429,{"$f":"VLOOKUP(E411,'[1]Combined AA and BB'!$A$1:$C$6133,3,FALSE)","v":"Y"}]
[null,null,null,null,20250,4240.2901130562932,{"$f":"VLOOKUP(E412,'[1]Combined AA and BB'!$A$1:$C$6133,3,FALSE)","v":"Y"}]
[null,null,null,null,20251,5235.154665531295,{"$f":"VLOOKUP(E413,'[1]Combined AA and BB'!$A$1:$C$6133,3,FALSE)","v":"Y"}]
[null,null,null,null,20500,1753.7137925806619,{"$f":"VLOOKUP(E414,'[1]Combined AA and BB'!$A$1:$C$6133,3,FALSE)","v":"Y"}]
[null,null,null,null,20501,"Bundled","NA"]
[null,null,null,null,20520,406.06280000000004,{"$f":"VLOOKUP(E416,'[1]Combined AA and BB'!$A$1:$C$6133,3,FALSE)","v":"Y"}]
[null,null,null,null,20525,1789.2422303467429,{"$f":"VLOOKUP(E417,'[1]Combined AA and BB'!$A$1:$C$6133,3,FALSE)","v":"Y"}]
[null,null,null,null,20526,151.23159999999999,{"$f":"VLOOKUP(E418,'[1]Combined AA and BB'!$A$1:$C$6133,3,FALSE)","v":"Y"}]
[null,null,null,null,20527,161.35339999999999,{"$f":"VLOOKUP(E419,'[1]Combined AA and BB'!$A$1:$C$6133,3,FALSE)","v":"Y"}]
[null,null,null,null,20550,106.5766,{"$f":"VLOOKUP(E420,'[1]Combined AA and BB'!$A$1:$C$6133,3,FALSE)","v":"Y"}]
[null,null,null,null,20551,106.5766,{"$f":"VLOOKUP(E421,'[1]Combined AA and BB'!$A$1:$C$6133,3,FALSE)","v":"Y"}]
[null,null,null,null,20552,97.645599999999988,{"$f":"VLOOKUP(E422,'[1]Combined AA and BB'!$A$1:$C$6133,3,FALSE)","v":"Y"}]
[null,null,null,null,20553,112.53059999999999,{"$f":"VLOOKUP(E423,'[1]Combined AA and BB'!$A$1:$C$6133,3,FALSE)","v":"Y"}]
[null,null,null,null,20555,"Not covered","NA"]
[null,null,null,null,20600,97.645599999999988,{"$f":"VLOOKUP(E425,'[1]Combined AA and BB'!$A$1:$C$6133,3,FALSE)","v":"Y"}]
[null,null,null,null,20604,152.42240000000001,{"$f":"VLOOKUP(E426,'[1]Combined AA and BB'!$A$1:$C$6133,3,FALSE)","v":"Y"}]
[null,null,null,null,20605,101.8134,{"$f":"VLOOKUP(E427,'[1]Combined AA and BB'!$A$1:$C$6133,3,FALSE)","v":"Y"}]
[null,null,null,null,20606,165.52119999999999,{"$f":"VLOOKUP(E428,'[1]Combined AA and BB'!$A$1:$C$6133,3,FALSE)","v":"Y"}]
[null,null,null,null,20610,118.4846,{"$f":"VLOOKUP(E429,'[1]Combined AA and BB'!$A$1:$C$6133,3,FALSE)","v":"Y"}]
[null,null,null,null,20611,184.57400000000001,{"$f":"VLOOKUP(E430,'[1]Combined AA and BB'!$A$1:$C$6133,3,FALSE)","v":"Y"}]
[null,null,null,null,20612,118.4846,{"$f":"VLOOKUP(E431,'[1]Combined AA and BB'!$A$1:$C$6133,3,FALSE)","v":"Y"}]
[null,null,null,null,20615,473.34300000000002,{"$f":"VLOOKUP(E432,'[1]Combined AA and BB'!$A$1:$C$6133,3,FALSE)","v":"Y"}]
[null,null,null,null,20650,2360.4308567939793,{"$f":"VLOOKUP(E433,'[1]Combined AA and BB'!$A$1:$C$6133,3,FALSE)","v":"Y"}]
[null,null,null,null,20662,1248.9885183021138,{"$f":"VLOOKUP(E434,'[1]Combined AA and BB'!$A$1:$C$6133,3,FALSE)","v":"Y"}]
[null,null,null,null,20663,2360.4308567939793,{"$f":"VLOOKUP(E435,'[1]Combined AA and BB'!$A$1:$C$6133,3,FALSE)","v":"Y"}]
[null,null,null,null,20665,327.97410787081333,{"$f":"VLOOKUP(E436,'[1]Combined AA and BB'!$A$1:$C$6133,3,FALSE)","v":"N"}]
[null,null,null,null,20670,1062.8859418079082,{"$f":"VLOOKUP(E437,'[1]Combined AA and BB'!$A$1:$C$6133,3,FALSE)","v":"N"}]
[null,null,null,null,20680,1789.2422303467429,{"$f":"VLOOKUP(E438,'[1]Combined AA and BB'!$A$1:$C$6133,3,FALSE)","v":"N"}]
[null,null,null,null,20690,9685.9987951365092,{"$f":"VLOOKUP(E439,'[1]Combined AA and BB'!$A$1:$C$6133,3,FALSE)","v":"Y"}]
[null,null,null,null,20692,19843.938976179386,{"$f":"VLOOKUP(E440,'[1]Combined AA and BB'!$A$1:$C$6133,3,FALSE)","v":"Y"}]
[null,null,null,null,20693,5235.154665531295,{"$f":"VLOOKUP(E441,'[1]Combined AA and BB'!$A$1:$C$6133,3,FALSE)","v":"Y"}]
[null,null,null,null,20694,1248.9885183021138,{"$f":"VLOOKUP(E442,'[1]Combined AA and BB'!$A$1:$C$6133,3,FALSE)","v":"N"}]
[null,null,null,null,20696,29196.806023177312,{"$f":"VLOOKUP(E443,'[1]Combined AA and BB'!$A$1:$C$6133,3,FALSE)","v":"Y"}]
[null,null,null,null,20697,1248.9885183021138,{"$f":"VLOOKUP(E444,'[1]Combined AA and BB'!$A$1:$C$6133,3,FALSE)","v":"Y"}]
[null,null,null,null,20822,1248.9885183021138,{"$f":"VLOOKUP(E445,'[1]Combined AA and BB'!$A$1:$C$6133,3,FALSE)","v":"Y"}]
[null,null,null,null,20900,9460.8870111157175,{"$f":"VLOOKUP(E446,'[1]Combined AA and BB'!$A$1:$C$6133,3,FALSE)","v":"Y"}]
[null,null,null,null,20902,5235.154665531295,{"$f":"VLOOKUP(E447,'[1]Combined AA and BB'!$A$1:$C$6133,3,FALSE)","v":"Y"}]
[null,null,null,null,20910,504.64741795035388,{"$f":"VLOOKUP(E448,'[1]Combined AA and BB'!$A$1:$C$6133,3,FALSE)","v":"Y"}]
[null,null,null,null,20912,2825.7867811155184,{"$f":"VLOOKUP(E449,'[1]Combined AA and BB'!$A$1:$C$6133,3,FALSE)","v":"Y"}]
[null,null,null,null,20920,1499.1841543066416,{"$f":"VLOOKUP(E450,'[1]Combined AA and BB'!$A$1:$C$6133,3,FALSE)","v":"Y"}]
[null,null,null,null,20922,1499.1841543066416,{"$f":"VLOOKUP(E451,'[1]Combined AA and BB'!$A$1:$C$6133,3,FALSE)","v":"Y"}]
[null,null,null,null,20924,8954.251752645494,{"$f":"VLOOKUP(E452,'[1]Combined AA and BB'!$A$1:$C$6133,3,FALSE)","v":"Y"}]
[null,null,null,null,20931,"Bundled","NA"]
[null,null,null,null,20932,"Bundled","NA"]
[null,null,null,null,20933,"Bundled","NA"]
[null,null,null,null,20934,"Bundled","NA"]
[null,null,null,null,20936,"Bundled","NA"]
[null,null,null,null,20939,"Bundled","NA"]
[null,null,null,null,20950,563.74037104996432,{"$f":"VLOOKUP(E459,'[1]Combined AA and BB'!$A$1:$C$6133,3,FALSE)","v":"Y"}]
[null,null,null,null,20972,5235.154665531295,{"$f":"VLOOKUP(E460,'[1]Combined AA and BB'!$A$1:$C$6133,3,FALSE)","v":"Y"}]
[null,null,null,null,20973,5235.154665531295,{"$f":"VLOOKUP(E461,'[1]Combined AA and BB'!$A$1:$C$6133,3,FALSE)","v":"Y"}]
[null,null,null,null,20975,"Bundled","NA"]
[null,null,null,null,20979,"Bundled","NA"]
[null,null,null,null,20982,"Not covered","NA"]
[null,null,null,null,20983,"Not covered","NA"]
[null,null,null,null,20985,"Bundled","NA"]
[null,null,null,null,21010,1916.5286762415849,{"$f":"VLOOKUP(E467,'[1]Combined AA and BB'!$A$1:$C$6133,3,FALSE)","v":"Y"}]
[null,null,null,null,21011,701.38119999999992,{"$f":"VLOOKUP(E468,'[1]Combined AA and BB'!$A$1:$C$6133,3,FALSE)","v":"Y"}]
[null,null,null,null,21012,1062.8859418079082,{"$f":"VLOOKUP(E469,'[1]Combined AA and BB'!$A$1:$C$6133,3,FALSE)","v":"Y"}]
[null,null,null,null,21013,999.67659999999989,{"$f":"VLOOKUP(E470,'[1]Combined AA and BB'!$A$1:$C$6133,3,FALSE)","v":"Y"}]
[null,null,null,null,21014,1789.2422303467429,{"$f":"VLOOKUP(E471,'[1]Combined AA and BB'!$A$1:$C$6133,3,FALSE)","v":"Y"}]
[null,null,null,null,21015,1789.2422303467429,{"$f":"VLOOKUP(E472,'[1]Combined AA and BB'!$A$1:$C$6133,3,FALSE)","v":"Y"}]
[null,null,null,null,21025,4253.3690655926366,{"$f":"VLOOKUP(E473,'[1]Combined AA and BB'!$A$1:$C$6133,3,FALSE)","v":"Y"}]
[null,null,null,null,21026,4253.3690655926366,{"$f":"VLOOKUP(E474,'[1]Combined AA and BB'!$A$1:$C$6133,3,FALSE)","v":"Y"}]
[null,null,null,null,21029,1916.5286762415849,{"$f":"VLOOKUP(E475,'[1]Combined AA and BB'!$A$1:$C$6133,3,FALSE)","v":"Y"}]
[null,null,null,null,21030,856.18520000000001,{"$f":"VLOOKUP(E476,'[1]Combined AA and BB'!$A$1:$C$6133,3,FALSE)","v":"Y"}]
[null,null,null,null,21031,718.64779999999996,{"$f":"VLOOKUP(E477,'[1]Combined AA and BB'!$A$1:$C$6133,3,FALSE)","v":"Y"}]
[null,null,null,null,21032,694.2364,{"$f":"VLOOKUP(E478,'[1]Combined AA and BB'!$A$1:$C$6133,3,FALSE)","v":"Y"}]
[null,null,null,null,21034,4253.3690655926366,{"$f":"VLOOKUP(E479,'[1]Combined AA and BB'!$A$1:$C$6133,3,FALSE)","v":"Y"}]
[null,null,null,null,21040,1916.5286762415849,{"$f":"VLOOKUP(E480,'[1]Combined AA and BB'!$A$1:$C$6133,3,FALSE)","v":"Y"}]
[null,null,null,null,21044,4253.3690655926366,{"$f":"VLOOKUP(E481,'[1]Combined AA and BB'!$A$1:$C$6133,3,FALSE)","v":"Y"}]
[null,null,null,null,21046,4253.3690655926366,{"$f":"VLOOKUP(E482,'[1]Combined AA and BB'!$A$1:$C$6133,3,FALSE)","v":"Y"}]
[null,null,null,null,21047,4253.3690655926366,{"$f":"VLOOKUP(E483,'[1]Combined AA and BB'!$A$1:$C$6133,3,FALSE)","v":"Y"}]
[null,null,null,null,21048,4253.3690655926366,{"$f":"VLOOKUP(E484,'[1]Combined AA and BB'!$A$1:$C$6133,3,FALSE)","v":"Y"}]
[null,null,null,null,21050,4253.3690655926366,{"$f":"VLOOKUP(E485,'[1]Combined AA and BB'!$A$1:$C$6133,3,FALSE)","v":"Y"}]
[null,null,null,null,21060,4253.3690655926366,{"$f":"VLOOKUP(E486,'[1]Combined AA and BB'!$A$1:$C$6133,3,FALSE)","v":"Y"}]
[null,null,null,null,21070,4253.3690655926366,{"$f":"VLOOKUP(E487,'[1]Combined AA and BB'!$A$1:$C$6133,3,FALSE)","v":"Y"}]
[null,null,null,null,21073,703.16740000000004,{"$f":"VLOOKUP(E488,'[1]Combined AA and BB'!$A$1:$C$6133,3,FALSE)","v":"Y"}]
[null,null,null,null,21076,1573.6422,{"$f":"VLOOKUP(E489,'[1]Combined AA and BB'!$A$1:$C$6133,3,FALSE)","v":"Y"}]
[null,null,null,null,21077,3854.0242000000003,{"$f":"VLOOKUP(E490,'[1]Combined AA and BB'!$A$1:$C$6133,3,FALSE)","v":"Y"}]
[null,null,null,null,21079,2641.7898,{"$f":"VLOOKUP(E491,'[1]Combined AA and BB'!$A$1:$C$6133,3,FALSE)","v":"Y"}]
[null,null,null,null,21080,3041.8986,{"$f":"VLOOKUP(E492,'[1]Combined AA and BB'!$A$1:$C$6133,3,FALSE)","v":"Y"}]
[null,null,null,null,21081,2806.7156,{"$f":"VLOOKUP(E493,'[1]Combined AA and BB'!$A$1:$C$6133,3,FALSE)","v":"Y"}]
[null,null,null,null,21082,2592.3715999999999,{"$f":"VLOOKUP(E494,'[1]Combined AA and BB'!$A$1:$C$6133,3,FALSE)","v":"Y"}]
[null,null,null,null,21083,2479.2456000000002,{"$f":"VLOOKUP(E495,'[1]Combined AA and BB'!$A$1:$C$6133,3,FALSE)","v":"Y"}]
[null,null,null,null,21084,2826.9591999999998,{"$f":"VLOOKUP(E496,'[1]Combined AA and BB'!$A$1:$C$6133,3,FALSE)","v":"Y"}]
[null,null,null,null,21085,180.53152367673368,{"$f":"VLOOKUP(E497,'[1]Combined AA and BB'!$A$1:$C$6133,3,FALSE)","v":"Y"}]
[null,null,null,null,21086,2868.0418,{"$f":"VLOOKUP(E498,'[1]Combined AA and BB'!$A$1:$C$6133,3,FALSE)","v":"Y"}]
[null,null,null,null,21087,2868.0418,{"$f":"VLOOKUP(E499,'[1]Combined AA and BB'!$A$1:$C$6133,3,FALSE)","v":"Y"}]
[null,null,null,null,21088,1916.5286762415849,{"$f":"VLOOKUP(E500,'[1]Combined AA and BB'!$A$1:$C$6133,3,FALSE)","v":"Y"}]
[null,null,null,null,21100,4253.3690655926366,{"$f":"VLOOKUP(E501,'[1]Combined AA and BB'!$A$1:$C$6133,3,FALSE)","v":"Y"}]
[null,null,null,null,21110,985.80817689537298,{"$f":"VLOOKUP(E502,'[1]Combined AA and BB'!$A$1:$C$6133,3,FALSE)","v":"N"}]
[null,null,null,null,21116,"Bundled","NA"]
[null,null,null,null,21120,4253.3690655926366,{"$f":"VLOOKUP(E504,'[1]Combined AA and BB'!$A$1:$C$6133,3,FALSE)","v":"Y"}]
[null,null,null,null,21121,1916.5286762415849,{"$f":"VLOOKUP(E505,'[1]Combined AA and BB'!$A$1:$C$6133,3,FALSE)","v":"Y"}]
[null,null,null,null,21122,7193.5832500462911,{"$f":"VLOOKUP(E506,'[1]Combined AA and BB'!$A$1:$C$6133,3,FALSE)","v":"Y"}]
[null,null,null,null,21123,1916.5286762415849,{"$f":"VLOOKUP(E507,'[1]Combined AA and BB'!$A$1:$C$6133,3,FALSE)","v":"Y"}]
[null,null,null,null,21125,4253.3690655926366,{"$f":"VLOOKUP(E508,'[1]Combined AA and BB'!$A$1:$C$6133,3,FALSE)","v":"Y"}]
[null,null,null,null,21127,7509.3908269111826,{"$f":"VLOOKUP(E509,'[1]Combined AA and BB'!$A$1:$C$6133,3,FALSE)","v":"Y"}]
[null,null,null,null,21137,1916.5286762415849,{"$f":"VLOOKUP(E510,'[1]Combined AA and BB'!$A$1:$C$6133,3,FALSE)","v":"Y"}]
[null,null,null,null,21138,4253.3690655926366,{"$f":"VLOOKUP(E511,'[1]Combined AA and BB'!$A$1:$C$6133,3,FALSE)","v":"Y"}]
[null,null,null,null,21139,4253.3690655926366,{"$f":"VLOOKUP(E512,'[1]Combined AA and BB'!$A$1:$C$6133,3,FALSE)","v":"Y"}]
[null,null,null,null,21150,7193.5832500462911,{"$f":"VLOOKUP(E513,'[1]Combined AA and BB'!$A$1:$C$6133,3,FALSE)","v":"Y"}]
[null,null,null,null,21181,4253.3690655926366,{"$f":"VLOOKUP(E514,'[1]Combined AA and BB'!$A$1:$C$6133,3,FALSE)","v":"Y"}]
[null,null,null,null,21198,4253.3690655926366,{"$f":"VLOOKUP(E515,'[1]Combined AA and BB'!$A$1:$C$6133,3,FALSE)","v":"Y"}]
[null,null,null,null,21199,7216.2571982573154,{"$f":"VLOOKUP(E516,'[1]Combined AA and BB'!$A$1:$C$6133,3,FALSE)","v":"Y"}]
[null,null,null,null,21206,4253.3690655926366,{"$f":"VLOOKUP(E517,'[1]Combined AA and BB'!$A$1:$C$6133,3,FALSE)","v":"Y"}]
[null,null,null,null,21208,3106.2018000000003,{"$f":"VLOOKUP(E518,'[1]Combined AA and BB'!$A$1:$C$6133,3,FALSE)","v":"Y"}]
[null,null,null,null,21209,4253.3690655926366,{"$f":"VLOOKUP(E519,'[1]Combined AA and BB'!$A$1:$C$6133,3,FALSE)","v":"Y"}]
[null,null,null,null,21210,8610.329390599265,{"$f":"VLOOKUP(E520,'[1]Combined AA and BB'!$A$1:$C$6133,3,FALSE)","v":"Y"}]
[null,null,null,null,21215,7171.4328970248807,{"$f":"VLOOKUP(E521,'[1]Combined AA and BB'!$A$1:$C$6133,3,FALSE)","v":"Y"}]
[null,null,null,null,21230,4253.3690655926366,{"$f":"VLOOKUP(E522,'[1]Combined AA and BB'!$A$1:$C$6133,3,FALSE)","v":"Y"}]
[null,null,null,null,21235,4253.3690655926366,{"$f":"VLOOKUP(E523,'[1]Combined AA and BB'!$A$1:$C$6133,3,FALSE)","v":"Y"}]
[null,null,null,null,21240,4253.3690655926366,{"$f":"VLOOKUP(E524,'[1]Combined AA and BB'!$A$1:$C$6133,3,FALSE)","v":"Y"}]
[null,null,null,null,21242,4253.3690655926366,{"$f":"VLOOKUP(E525,'[1]Combined AA and BB'!$A$1:$C$6133,3,FALSE)","v":"Y"}]
[null,null,null,null,21243,34095.926857319093,{"$f":"VLOOKUP(E526,'[1]Combined AA and BB'!$A$1:$C$6133,3,FALSE)","v":"Y"}]
[null,null,null,null,21244,8068.8636695157256,{"$f":"VLOOKUP(E527,'[1]Combined AA and BB'!$A$1:$C$6133,3,FALSE)","v":"Y"}]
[null,null,null,null,21245,7193.5832500462911,{"$f":"VLOOKUP(E528,'[1]Combined AA and BB'!$A$1:$C$6133,3,FALSE)","v":"Y"}]
[null,null,null,null,21246,4253.3690655926366,{"$f":"VLOOKUP(E529,'[1]Combined AA and BB'!$A$1:$C$6133,3,FALSE)","v":"Y"}]
[null,null,null,null,21248,4253.3690655926366,{"$f":"VLOOKUP(E530,'[1]Combined AA and BB'!$A$1:$C$6133,3,FALSE)","v":"Y"}]
[null,null,null,null,21249,4253.3690655926366,{"$f":"VLOOKUP(E531,'[1]Combined AA and BB'!$A$1:$C$6133,3,FALSE)","v":"Y"}]
[null,null,null,null,21260,"Not covered","NA"]
[null,null,null,null,21267,"Not covered","NA"]
[null,null,null,null,21270,4253.3690655926366,{"$f":"VLOOKUP(E534,'[1]Combined AA and BB'!$A$1:$C$6133,3,FALSE)","v":"Y"}]
[null,null,null,null,21275,4253.3690655926366,{"$f":"VLOOKUP(E535,'[1]Combined AA and BB'!$A$1:$C$6133,3,FALSE)","v":"Y"}]
[null,null,null,null,21280,1916.5286762415849,{"$f":"VLOOKUP(E536,'[1]Combined AA and BB'!$A$1:$C$6133,3,FALSE)","v":"Y"}]
[null,null,null,null,21282,1916.5286762415849,{"$f":"VLOOKUP(E537,'[1]Combined AA and BB'!$A$1:$C$6133,3,FALSE)","v":"Y"}]
[null,null,null,null,21295,"Not covered","NA"]
[null,null,null,null,21296,"Not covered","NA"]
[null,null,null,null,21315,985.80817689537298,{"$f":"VLOOKUP(E540,'[1]Combined AA and BB'!$A$1:$C$6133,3,FALSE)","v":"Y"}]
[null,null,null,null,21320,1916.5286762415849,{"$f":"VLOOKUP(E541,'[1]Combined AA and BB'!$A$1:$C$6133,3,FALSE)","v":"Y"}]
[null,null,null,null,21325,1916.5286762415849,{"$f":"VLOOKUP(E542,'[1]Combined AA and BB'!$A$1:$C$6133,3,FALSE)","v":"Y"}]
[null,null,null,null,21330,4253.3690655926366,{"$f":"VLOOKUP(E543,'[1]Combined AA and BB'!$A$1:$C$6133,3,FALSE)","v":"Y"}]
[null,null,null,null,21335,1916.5286762415849,{"$f":"VLOOKUP(E544,'[1]Combined AA and BB'!$A$1:$C$6133,3,FALSE)","v":"Y"}]
[null,null,null,null,21336,2360.4308567939793,{"$f":"VLOOKUP(E545,'[1]Combined AA and BB'!$A$1:$C$6133,3,FALSE)","v":"Y"}]
[null,null,null,null,21337,1916.5286762415849,{"$f":"VLOOKUP(E546,'[1]Combined AA and BB'!$A$1:$C$6133,3,FALSE)","v":"Y"}]
[null,null,null,null,21338,8016.8342431740639,{"$f":"VLOOKUP(E547,'[1]Combined AA and BB'!$A$1:$C$6133,3,FALSE)","v":"Y"}]
[null,null,null,null,21339,4253.3690655926366,{"$f":"VLOOKUP(E548,'[1]Combined AA and BB'!$A$1:$C$6133,3,FALSE)","v":"Y"}]
[null,null,null,null,21340,1916.5286762415849,{"$f":"VLOOKUP(E549,'[1]Combined AA and BB'!$A$1:$C$6133,3,FALSE)","v":"Y"}]
[null,null,null,null,21345,985.80817689537298,{"$f":"VLOOKUP(E550,'[1]Combined AA and BB'!$A$1:$C$6133,3,FALSE)","v":"Y"}]
[null,null,null,null,21355,1916.5286762415849,{"$f":"VLOOKUP(E551,'[1]Combined AA and BB'!$A$1:$C$6133,3,FALSE)","v":"Y"}]
[null,null,null,null,21356,4253.3690655926366,{"$f":"VLOOKUP(E552,'[1]Combined AA and BB'!$A$1:$C$6133,3,FALSE)","v":"Y"}]
[null,null,null,null,21360,4253.3690655926366,{"$f":"VLOOKUP(E553,'[1]Combined AA and BB'!$A$1:$C$6133,3,FALSE)","v":"Y"}]
[null,null,null,null,21390,4253.3690655926366,{"$f":"VLOOKUP(E554,'[1]Combined AA and BB'!$A$1:$C$6133,3,FALSE)","v":"Y"}]
[null,null,null,null,21400,396.81640340099921,{"$f":"VLOOKUP(E555,'[1]Combined AA and BB'!$A$1:$C$6133,3,FALSE)","v":"Y"}]
[null,null,null,null,21401,1670.2572723581579,{"$f":"VLOOKUP(E556,'[1]Combined AA and BB'!$A$1:$C$6133,3,FALSE)","v":"Y"}]
[null,null,null,null,21406,4253.3690655926366,{"$f":"VLOOKUP(E557,'[1]Combined AA and BB'!$A$1:$C$6133,3,FALSE)","v":"Y"}]
[null,null,null,null,21407,4253.3690655926366,{"$f":"VLOOKUP(E558,'[1]Combined AA and BB'!$A$1:$C$6133,3,FALSE)","v":"Y"}]
[null,null,null,null,21421,1916.5286762415849,{"$f":"VLOOKUP(E559,'[1]Combined AA and BB'!$A$1:$C$6133,3,FALSE)","v":"Y"}]
[null,null,null,null,21440,1309.2846,{"$f":"VLOOKUP(E560,'[1]Combined AA and BB'!$A$1:$C$6133,3,FALSE)","v":"Y"}]
[null,null,null,null,21445,7221.9256853100724,{"$f":"VLOOKUP(E561,'[1]Combined AA and BB'!$A$1:$C$6133,3,FALSE)","v":"Y"}]
[null,null,null,null,21450,734.68372855449002,{"$f":"VLOOKUP(E562,'[1]Combined AA and BB'!$A$1:$C$6133,3,FALSE)","v":"Y"}]
[null,null,null,null,21451,985.80817689537298,{"$f":"VLOOKUP(E563,'[1]Combined AA and BB'!$A$1:$C$6133,3,FALSE)","v":"Y"}]
[null,null,null,null,21452,7271.9062609097737,{"$f":"VLOOKUP(E564,'[1]Combined AA and BB'!$A$1:$C$6133,3,FALSE)","v":"Y"}]
[null,null,null,null,21453,7332.6888329212543,{"$f":"VLOOKUP(E565,'[1]Combined AA and BB'!$A$1:$C$6133,3,FALSE)","v":"Y"}]
[null,null,null,null,21454,7230.6788309798912,{"$f":"VLOOKUP(E566,'[1]Combined AA and BB'!$A$1:$C$6133,3,FALSE)","v":"Y"}]
[null,null,null,null,21461,7692.2849031434771,{"$f":"VLOOKUP(E567,'[1]Combined AA and BB'!$A$1:$C$6133,3,FALSE)","v":"Y"}]
[null,null,null,null,21462,7468.698374675032,{"$f":"VLOOKUP(E568,'[1]Combined AA and BB'!$A$1:$C$6133,3,FALSE)","v":"Y"}]
[null,null,null,null,21465,4253.3690655926366,{"$f":"VLOOKUP(E569,'[1]Combined AA and BB'!$A$1:$C$6133,3,FALSE)","v":"Y"}]
[null,null,null,null,21480,179.82216601985061,{"$f":"VLOOKUP(E570,'[1]Combined AA and BB'!$A$1:$C$6133,3,FALSE)","v":"Y"}]
[null,null,null,null,21485,985.80817689537298,{"$f":"VLOOKUP(E571,'[1]Combined AA and BB'!$A$1:$C$6133,3,FALSE)","v":"Y"}]
[null,null,null,null,21490,1916.5286762415849,{"$f":"VLOOKUP(E572,'[1]Combined AA and BB'!$A$1:$C$6133,3,FALSE)","v":"Y"}]
[null,null,null,null,21497,985.80817689537298,{"$f":"VLOOKUP(E573,'[1]Combined AA and BB'!$A$1:$C$6133,3,FALSE)","v":"Y"}]
[null,null,null,null,21501,1789.2422303467429,{"$f":"VLOOKUP(E574,'[1]Combined AA and BB'!$A$1:$C$6133,3,FALSE)","v":"Y"}]
[null,null,null,null,21502,2360.4308567939793,{"$f":"VLOOKUP(E575,'[1]Combined AA and BB'!$A$1:$C$6133,3,FALSE)","v":"Y"}]
[null,null,null,null,21550,1062.8859418079082,{"$f":"VLOOKUP(E576,'[1]Combined AA and BB'!$A$1:$C$6133,3,FALSE)","v":"Y"}]
[null,null,null,null,21552,1789.2422303467429,{"$f":"VLOOKUP(E577,'[1]Combined AA and BB'!$A$1:$C$6133,3,FALSE)","v":"Y"}]
[null,null,null,null,21554,1789.2422303467429,{"$f":"VLOOKUP(E578,'[1]Combined AA and BB'!$A$1:$C$6133,3,FALSE)","v":"Y"}]
[null,null,null,null,21555,1062.8859418079082,{"$f":"VLOOKUP(E579,'[1]Combined AA and BB'!$A$1:$C$6133,3,FALSE)","v":"Y"}]
[null,null,null,null,21556,1789.2422303467429,{"$f":"VLOOKUP(E580,'[1]Combined AA and BB'!$A$1:$C$6133,3,FALSE)","v":"Y"}]
[null,null,null,null,21557,1789.2422303467429,{"$f":"VLOOKUP(E581,'[1]Combined AA and BB'!$A$1:$C$6133,3,FALSE)","v":"Y"}]
[null,null,null,null,21600,5235.154665531295,{"$f":"VLOOKUP(E582,'[1]Combined AA and BB'!$A$1:$C$6133,3,FALSE)","v":"Y"}]
[null,null,null,null,21610,2360.4308567939793,{"$f":"VLOOKUP(E583,'[1]Combined AA and BB'!$A$1:$C$6133,3,FALSE)","v":"Y"}]
[null,null,null,null,21685,"Not covered","NA"]
[null,null,null,null,21700,5235.154665531295,{"$f":"VLOOKUP(E585,'[1]Combined AA and BB'!$A$1:$C$6133,3,FALSE)","v":"Y"}]
[null,null,null,null,21720,2360.4308567939793,{"$f":"VLOOKUP(E586,'[1]Combined AA and BB'!$A$1:$C$6133,3,FALSE)","v":"Y"}]
[null,null,null,null,21725,563.74037104996432,{"$f":"VLOOKUP(E587,'[1]Combined AA and BB'!$A$1:$C$6133,3,FALSE)","v":"Y"}]
[null,null,null,null,21820,179.82216601985061,{"$f":"VLOOKUP(E588,'[1]Combined AA and BB'!$A$1:$C$6133,3,FALSE)","v":"Y"}]
[null,null,null,null,21920,482.27399999999994,{"$f":"VLOOKUP(E589,'[1]Combined AA and BB'!$A$1:$C$6133,3,FALSE)","v":"Y"}]
[null,null,null,null,21925,1062.8859418079082,{"$f":"VLOOKUP(E590,'[1]Combined AA and BB'!$A$1:$C$6133,3,FALSE)","v":"Y"}]
[null,null,null,null,21930,1062.8859418079082,{"$f":"VLOOKUP(E591,'[1]Combined AA and BB'!$A$1:$C$6133,3,FALSE)","v":"Y"}]
[null,null,null,null,21931,1062.8859418079082,{"$f":"VLOOKUP(E592,'[1]Combined AA and BB'!$A$1:$C$6133,3,FALSE)","v":"Y"}]
[null,null,null,null,21932,1789.2422303467429,{"$f":"VLOOKUP(E593,'[1]Combined AA and BB'!$A$1:$C$6133,3,FALSE)","v":"Y"}]
[null,null,null,null,21933,1789.2422303467429,{"$f":"VLOOKUP(E594,'[1]Combined AA and BB'!$A$1:$C$6133,3,FALSE)","v":"Y"}]
[null,null,null,null,21935,1789.2422303467429,{"$f":"VLOOKUP(E595,'[1]Combined AA and BB'!$A$1:$C$6133,3,FALSE)","v":"Y"}]
[null,null,null,null,22102,5235.154665531295,{"$f":"VLOOKUP(E596,'[1]Combined AA and BB'!$A$1:$C$6133,3,FALSE)","v":"Y"}]
[null,null,null,null,22103,"Bundled","NA"]
[null,null,null,null,22310,179.82216601985061,{"$f":"VLOOKUP(E598,'[1]Combined AA and BB'!$A$1:$C$6133,3,FALSE)","v":"Y"}]
[null,null,null,null,22315,2360.4308567939793,{"$f":"VLOOKUP(E599,'[1]Combined AA and BB'!$A$1:$C$6133,3,FALSE)","v":"Y"}]
[null,null,null,null,22505,1248.9885183021138,{"$f":"VLOOKUP(E600,'[1]Combined AA and BB'!$A$1:$C$6133,3,FALSE)","v":"Y"}]
[null,null,null,null,22510,"Not covered","NA"]
[null,null,null,null,22511,"Not covered","NA"]
[null,null,null,null,22512,"Not covered","NA"]
[null,null,null,null,22513,"Not covered","NA"]
[null,null,null,null,22514,"Not covered","NA"]
[null,null,null,null,22515,"Not covered","NA"]
[null,null,null,null,22551,20049.381793077358,{"$f":"VLOOKUP(E607,'[1]Combined AA and BB'!$A$1:$C$6133,3,FALSE)","v":"Y"}]
[null,null,null,null,22552,"Bundled","NA"]
[null,null,null,null,22554,19768.529886371136,{"$f":"VLOOKUP(E609,'[1]Combined AA and BB'!$A$1:$C$6133,3,FALSE)","v":"Y"}]
[null,null,null,null,22585,"Bundled","NA"]
[null,null,null,null,22612,34905.109075352069,{"$f":"VLOOKUP(E611,'[1]Combined AA and BB'!$A$1:$C$6133,3,FALSE)","v":"Y"}]
[null,null,null,null,22614,"Bundled","NA"]
[null,null,null,null,22845,"Bundled","NA"]
[null,null,null,null,22850,"UR/BR","N "]
[null,null,null,null,22852,"UR/BR","N"]
[null,null,null,null,22853,"Bundled","NA"]
[null,null,null,null,22854,"Bundled","NA"]
[null,null,null,null,22856,33778.093194720488,{"$f":"VLOOKUP(E618,'[1]Combined AA and BB'!$A$1:$C$6133,3,FALSE)","v":"Y"}]
[null,null,null,null,22858,"Bundled","NA"]
[null,null,null,null,22859,"Bundled","NA"]
[null,null,null,null,22867,36502.620763866536,{"$f":"VLOOKUP(E621,'[1]Combined AA and BB'!$A$1:$C$6133,3,FALSE)","v":"Y"}]
[null,null,null,null,22868,"Bundled","NA"]
[null,null,null,null,22869,24055.271998749311,{"$f":"VLOOKUP(E623,'[1]Combined AA and BB'!$A$1:$C$6133,3,FALSE)","v":"Y"}]
[null,null,null,null,22870,"Bundled","NA"]
[null,null,null,null,22900,1789.2422303467429,{"$f":"VLOOKUP(E625,'[1]Combined AA and BB'!$A$1:$C$6133,3,FALSE)","v":"Y"}]
[null,null,null,null,22901,1789.2422303467429,{"$f":"VLOOKUP(E626,'[1]Combined AA and BB'!$A$1:$C$6133,3,FALSE)","v":"Y"}]
[null,null,null,null,22902,1062.8859418079082,{"$f":"VLOOKUP(E627,'[1]Combined AA and BB'!$A$1:$C$6133,3,FALSE)","v":"Y"}]
[null,null,null,null,22903,1789.2422303467429,{"$f":"VLOOKUP(E628,'[1]Combined AA and BB'!$A$1:$C$6133,3,FALSE)","v":"Y"}]
[null,null,null,null,23000,1789.2422303467429,{"$f":"VLOOKUP(E629,'[1]Combined AA and BB'!$A$1:$C$6133,3,FALSE)","v":"Y"}]
[null,null,null,null,23020,2360.4308567939793,{"$f":"VLOOKUP(E630,'[1]Combined AA and BB'!$A$1:$C$6133,3,FALSE)","v":"Y"}]
[null,null,null,null,23030,1789.2422303467429,{"$f":"VLOOKUP(E631,'[1]Combined AA and BB'!$A$1:$C$6133,3,FALSE)","v":"Y"}]
[null,null,null,null,23031,1789.2422303467429,{"$f":"VLOOKUP(E632,'[1]Combined AA and BB'!$A$1:$C$6133,3,FALSE)","v":"Y"}]
[null,null,null,null,23035,1248.9885183021138,{"$f":"VLOOKUP(E633,'[1]Combined AA and BB'!$A$1:$C$6133,3,FALSE)","v":"Y"}]
[null,null,null,null,23040,2360.4308567939793,{"$f":"VLOOKUP(E634,'[1]Combined AA and BB'!$A$1:$C$6133,3,FALSE)","v":"Y"}]
[null,null,null,null,23044,2360.4308567939793,{"$f":"VLOOKUP(E635,'[1]Combined AA and BB'!$A$1:$C$6133,3,FALSE)","v":"Y"}]
[null,null,null,null,23065,"Not covered","NA"]
[null,null,null,null,23066,1789.2422303467429,{"$f":"VLOOKUP(E637,'[1]Combined AA and BB'!$A$1:$C$6133,3,FALSE)","v":"Y"}]
[null,null,null,null,23071,1062.8859418079082,{"$f":"VLOOKUP(E638,'[1]Combined AA and BB'!$A$1:$C$6133,3,FALSE)","v":"Y"}]
[null,null,null,null,23073,1789.2422303467429,{"$f":"VLOOKUP(E639,'[1]Combined AA and BB'!$A$1:$C$6133,3,FALSE)","v":"Y"}]
[null,null,null,null,23075,1062.8859418079082,{"$f":"VLOOKUP(E640,'[1]Combined AA and BB'!$A$1:$C$6133,3,FALSE)","v":"Y"}]
[null,null,null,null,23076,1789.2422303467429,{"$f":"VLOOKUP(E641,'[1]Combined AA and BB'!$A$1:$C$6133,3,FALSE)","v":"Y"}]
[null,null,null,null,23077,"Not covered","NA"]
[null,null,null,null,23100,2360.4308567939793,{"$f":"VLOOKUP(E643,'[1]Combined AA and BB'!$A$1:$C$6133,3,FALSE)","v":"Y"}]
[null,null,null,null,23101,2360.4308567939793,{"$f":"VLOOKUP(E644,'[1]Combined AA and BB'!$A$1:$C$6133,3,FALSE)","v":"Y"}]
[null,null,null,null,23105,5235.154665531295,{"$f":"VLOOKUP(E645,'[1]Combined AA and BB'!$A$1:$C$6133,3,FALSE)","v":"Y"}]
[null,null,null,null,23106,2360.4308567939793,{"$f":"VLOOKUP(E646,'[1]Combined AA and BB'!$A$1:$C$6133,3,FALSE)","v":"Y"}]
[null,null,null,null,23107,5235.154665531295,{"$f":"VLOOKUP(E647,'[1]Combined AA and BB'!$A$1:$C$6133,3,FALSE)","v":"Y"}]
[null,null,null,null,23120,2360.4308567939793,{"$f":"VLOOKUP(E648,'[1]Combined AA and BB'!$A$1:$C$6133,3,FALSE)","v":"Y"}]
[null,null,null,null,23125,2360.4308567939793,{"$f":"VLOOKUP(E649,'[1]Combined AA and BB'!$A$1:$C$6133,3,FALSE)","v":"Y"}]
[null,null,null,null,23130,2360.4308567939793,{"$f":"VLOOKUP(E650,'[1]Combined AA and BB'!$A$1:$C$6133,3,FALSE)","v":"Y"}]
[null,null,null,null,23140,2360.4308567939793,{"$f":"VLOOKUP(E651,'[1]Combined AA and BB'!$A$1:$C$6133,3,FALSE)","v":"Y"}]
[null,null,null,null,23145,2360.4308567939793,{"$f":"VLOOKUP(E652,'[1]Combined AA and BB'!$A$1:$C$6133,3,FALSE)","v":"Y"}]
[null,null,null,null,23146,5235.154665531295,{"$f":"VLOOKUP(E653,'[1]Combined AA and BB'!$A$1:$C$6133,3,FALSE)","v":"Y"}]
[null,null,null,null,23150,2360.4308567939793,{"$f":"VLOOKUP(E654,'[1]Combined AA and BB'!$A$1:$C$6133,3,FALSE)","v":"Y"}]
[null,null,null,null,23155,5235.154665531295,{"$f":"VLOOKUP(E655,'[1]Combined AA and BB'!$A$1:$C$6133,3,FALSE)","v":"Y"}]
[null,null,null,null,23156,5235.154665531295,{"$f":"VLOOKUP(E656,'[1]Combined AA and BB'!$A$1:$C$6133,3,FALSE)","v":"Y"}]
[null,null,null,null,23170,2360.4308567939793,{"$f":"VLOOKUP(E657,'[1]Combined AA and BB'!$A$1:$C$6133,3,FALSE)","v":"Y"}]
[null,null,null,null,23172,2360.4308567939793,{"$f":"VLOOKUP(E658,'[1]Combined AA and BB'!$A$1:$C$6133,3,FALSE)","v":"Y"}]
[null,null,null,null,23174,5235.154665531295,{"$f":"VLOOKUP(E659,'[1]Combined AA and BB'!$A$1:$C$6133,3,FALSE)","v":"Y"}]
[null,null,null,null,23180,5235.154665531295,{"$f":"VLOOKUP(E660,'[1]Combined AA and BB'!$A$1:$C$6133,3,FALSE)","v":"Y"}]
[null,null,null,null,23182,5235.154665531295,{"$f":"VLOOKUP(E661,'[1]Combined AA and BB'!$A$1:$C$6133,3,FALSE)","v":"Y"}]
[null,null,null,null,23184,5235.154665531295,{"$f":"VLOOKUP(E662,'[1]Combined AA and BB'!$A$1:$C$6133,3,FALSE)","v":"Y"}]
[null,null,null,null,23190,2360.4308567939793,{"$f":"VLOOKUP(E663,'[1]Combined AA and BB'!$A$1:$C$6133,3,FALSE)","v":"Y"}]
[null,null,null,null,23195,5235.154665531295,{"$f":"VLOOKUP(E664,'[1]Combined AA and BB'!$A$1:$C$6133,3,FALSE)","v":"Y"}]
[null,null,null,null,23330,1062.8859418079082,{"$f":"VLOOKUP(E665,'[1]Combined AA and BB'!$A$1:$C$6133,3,FALSE)","v":"Y"}]
[null,null,null,null,23333,1789.2422303467429,{"$f":"VLOOKUP(E666,'[1]Combined AA and BB'!$A$1:$C$6133,3,FALSE)","v":"Y"}]
[null,null,null,null,23334,1789.2422303467429,{"$f":"VLOOKUP(E667,'[1]Combined AA and BB'!$A$1:$C$6133,3,FALSE)","v":"Y"}]
[null,null,null,null,23350,"Bundled","NA"]
[null,null,null,null,23395,9140.0256024206574,{"$f":"VLOOKUP(E669,'[1]Combined AA and BB'!$A$1:$C$6133,3,FALSE)","v":"Y"}]
[null,null,null,null,23397,5235.154665531295,{"$f":"VLOOKUP(E670,'[1]Combined AA and BB'!$A$1:$C$6133,3,FALSE)","v":"Y"}]
[null,null,null,null,23400,5235.154665531295,{"$f":"VLOOKUP(E671,'[1]Combined AA and BB'!$A$1:$C$6133,3,FALSE)","v":"Y"}]
[null,null,null,null,23405,5235.154665531295,{"$f":"VLOOKUP(E672,'[1]Combined AA and BB'!$A$1:$C$6133,3,FALSE)","v":"Y"}]
[null,null,null,null,23406,8799.5179916110283,{"$f":"VLOOKUP(E673,'[1]Combined AA and BB'!$A$1:$C$6133,3,FALSE)","v":"Y"}]
[null,null,null,null,23410,5235.154665531295,{"$f":"VLOOKUP(E674,'[1]Combined AA and BB'!$A$1:$C$6133,3,FALSE)","v":"Y"}]
[null,null,null,null,23412,5235.154665531295,{"$f":"VLOOKUP(E675,'[1]Combined AA and BB'!$A$1:$C$6133,3,FALSE)","v":"Y"}]
[null,null,null,null,23415,5235.154665531295,{"$f":"VLOOKUP(E676,'[1]Combined AA and BB'!$A$1:$C$6133,3,FALSE)","v":"Y"}]
[null,null,null,null,23420,5235.154665531295,{"$f":"VLOOKUP(E677,'[1]Combined AA and BB'!$A$1:$C$6133,3,FALSE)","v":"Y"}]
[null,null,null,null,23430,9041.7262968230661,{"$f":"VLOOKUP(E678,'[1]Combined AA and BB'!$A$1:$C$6133,3,FALSE)","v":"Y"}]
[null,null,null,null,23440,5235.154665531295,{"$f":"VLOOKUP(E679,'[1]Combined AA and BB'!$A$1:$C$6133,3,FALSE)","v":"Y"}]
[null,null,null,null,23450,9583.2603129313375,{"$f":"VLOOKUP(E680,'[1]Combined AA and BB'!$A$1:$C$6133,3,FALSE)","v":"Y"}]
[null,null,null,null,23455,5235.154665531295,{"$f":"VLOOKUP(E681,'[1]Combined AA and BB'!$A$1:$C$6133,3,FALSE)","v":"Y"}]
[null,null,null,null,23460,5235.154665531295,{"$f":"VLOOKUP(E682,'[1]Combined AA and BB'!$A$1:$C$6133,3,FALSE)","v":"Y"}]
[null,null,null,null,23462,5235.154665531295,{"$f":"VLOOKUP(E683,'[1]Combined AA and BB'!$A$1:$C$6133,3,FALSE)","v":"Y"}]
[null,null,null,null,23465,5235.154665531295,{"$f":"VLOOKUP(E684,'[1]Combined AA and BB'!$A$1:$C$6133,3,FALSE)","v":"Y"}]
[null,null,null,null,23466,5235.154665531295,{"$f":"VLOOKUP(E685,'[1]Combined AA and BB'!$A$1:$C$6133,3,FALSE)","v":"Y"}]
[null,null,null,null,23480,5235.154665531295,{"$f":"VLOOKUP(E686,'[1]Combined AA and BB'!$A$1:$C$6133,3,FALSE)","v":"Y"}]
[null,null,null,null,23485,20474.541087042304,{"$f":"VLOOKUP(E687,'[1]Combined AA and BB'!$A$1:$C$6133,3,FALSE)","v":"Y"}]
[null,null,null,null,23490,5235.154665531295,{"$f":"VLOOKUP(E688,'[1]Combined AA and BB'!$A$1:$C$6133,3,FALSE)","v":"Y"}]
[null,null,null,null,23491,19046.936037556941,{"$f":"VLOOKUP(E689,'[1]Combined AA and BB'!$A$1:$C$6133,3,FALSE)","v":"Y"}]
[null,null,null,null,23500,179.82216601985061,{"$f":"VLOOKUP(E690,'[1]Combined AA and BB'!$A$1:$C$6133,3,FALSE)","v":"Y"}]
[null,null,null,null,23505,1248.9885183021138,{"$f":"VLOOKUP(E691,'[1]Combined AA and BB'!$A$1:$C$6133,3,FALSE)","v":"Y"}]
[null,null,null,null,23515,9433.6259137435245,{"$f":"VLOOKUP(E692,'[1]Combined AA and BB'!$A$1:$C$6133,3,FALSE)","v":"Y"}]
[null,null,null,null,23520,1248.9885183021138,{"$f":"VLOOKUP(E693,'[1]Combined AA and BB'!$A$1:$C$6133,3,FALSE)","v":"Y"}]
[null,null,null,null,23525,179.82216601985061,{"$f":"VLOOKUP(E694,'[1]Combined AA and BB'!$A$1:$C$6133,3,FALSE)","v":"Y"}]
[null,null,null,null,23530,5235.154665531295,{"$f":"VLOOKUP(E695,'[1]Combined AA and BB'!$A$1:$C$6133,3,FALSE)","v":"Y"}]
[null,null,null,null,23532,5235.154665531295,{"$f":"VLOOKUP(E696,'[1]Combined AA and BB'!$A$1:$C$6133,3,FALSE)","v":"Y"}]
[null,null,null,null,23540,179.82216601985061,{"$f":"VLOOKUP(E697,'[1]Combined AA and BB'!$A$1:$C$6133,3,FALSE)","v":"Y"}]
[null,null,null,null,23545,179.82216601985061,{"$f":"VLOOKUP(E698,'[1]Combined AA and BB'!$A$1:$C$6133,3,FALSE)","v":"Y"}]
[null,null,null,null,23550,9253.5319335252407,{"$f":"VLOOKUP(E699,'[1]Combined AA and BB'!$A$1:$C$6133,3,FALSE)","v":"Y"}]
[null,null,null,null,23552,8943.4611387378391,{"$f":"VLOOKUP(E700,'[1]Combined AA and BB'!$A$1:$C$6133,3,FALSE)","v":"Y"}]
[null,null,null,null,23570,179.82216601985061,{"$f":"VLOOKUP(E701,'[1]Combined AA and BB'!$A$1:$C$6133,3,FALSE)","v":"Y"}]
[null,null,null,null,23575,1248.9885183021138,{"$f":"VLOOKUP(E702,'[1]Combined AA and BB'!$A$1:$C$6133,3,FALSE)","v":"Y"}]
[null,null,null,null,23585,9483.720314384449,{"$f":"VLOOKUP(E703,'[1]Combined AA and BB'!$A$1:$C$6133,3,FALSE)","v":"Y"}]
[null,null,null,null,23600,179.82216601985061,{"$f":"VLOOKUP(E704,'[1]Combined AA and BB'!$A$1:$C$6133,3,FALSE)","v":"Y"}]
[null,null,null,null,23605,1248.9885183021138,{"$f":"VLOOKUP(E705,'[1]Combined AA and BB'!$A$1:$C$6133,3,FALSE)","v":"Y"}]
[null,null,null,null,23615,19964.866699971513,{"$f":"VLOOKUP(E706,'[1]Combined AA and BB'!$A$1:$C$6133,3,FALSE)","v":"Y"}]
[null,null,null,null,23616,34587.29817776171,{"$f":"VLOOKUP(E707,'[1]Combined AA and BB'!$A$1:$C$6133,3,FALSE)","v":"Y"}]
[null,null,null,null,23620,179.82216601985061,{"$f":"VLOOKUP(E708,'[1]Combined AA and BB'!$A$1:$C$6133,3,FALSE)","v":"Y"}]
[null,null,null,null,23625,1248.9885183021138,{"$f":"VLOOKUP(E709,'[1]Combined AA and BB'!$A$1:$C$6133,3,FALSE)","v":"Y"}]
[null,null,null,null,23630,8889.5649817201702,{"$f":"VLOOKUP(E710,'[1]Combined AA and BB'!$A$1:$C$6133,3,FALSE)","v":"Y"}]
[null,null,null,null,23650,179.82216601985061,{"$f":"VLOOKUP(E711,'[1]Combined AA and BB'!$A$1:$C$6133,3,FALSE)","v":"Y"}]
[null,null,null,null,23655,1248.9885183021138,{"$f":"VLOOKUP(E712,'[1]Combined AA and BB'!$A$1:$C$6133,3,FALSE)","v":"Y"}]
[null,null,null,null,23660,5235.154665531295,{"$f":"VLOOKUP(E713,'[1]Combined AA and BB'!$A$1:$C$6133,3,FALSE)","v":"Y"}]
[null,null,null,null,23665,1248.9885183021138,{"$f":"VLOOKUP(E714,'[1]Combined AA and BB'!$A$1:$C$6133,3,FALSE)","v":"Y"}]
[null,null,null,null,23670,8826.1530512565078,{"$f":"VLOOKUP(E715,'[1]Combined AA and BB'!$A$1:$C$6133,3,FALSE)","v":"Y"}]
[null,null,null,null,23675,1248.9885183021138,{"$f":"VLOOKUP(E716,'[1]Combined AA and BB'!$A$1:$C$6133,3,FALSE)","v":"Y"}]
[null,null,null,null,23680,18985.823372925926,{"$f":"VLOOKUP(E717,'[1]Combined AA and BB'!$A$1:$C$6133,3,FALSE)","v":"Y"}]
[null,null,null,null,23700,1248.9885183021138,{"$f":"VLOOKUP(E718,'[1]Combined AA and BB'!$A$1:$C$6133,3,FALSE)","v":"Y"}]
[null,null,null,null,23800,5235.154665531295,{"$f":"VLOOKUP(E719,'[1]Combined AA and BB'!$A$1:$C$6133,3,FALSE)","v":"Y"}]
[null,null,null,null,23802,10734.562359657788,{"$f":"VLOOKUP(E720,'[1]Combined AA and BB'!$A$1:$C$6133,3,FALSE)","v":"Y"}]
[null,null,null,null,23921,1499.1841543066416,{"$f":"VLOOKUP(E721,'[1]Combined AA and BB'!$A$1:$C$6133,3,FALSE)","v":"Y"}]
[null,null,null,null,23930,1789.2422303467429,{"$f":"VLOOKUP(E722,'[1]Combined AA and BB'!$A$1:$C$6133,3,FALSE)","v":"Y"}]
[null,null,null,null,23931,1062.8859418079082,{"$f":"VLOOKUP(E723,'[1]Combined AA and BB'!$A$1:$C$6133,3,FALSE)","v":"Y"}]
[null,null,null,null,23935,2360.4308567939793,{"$f":"VLOOKUP(E724,'[1]Combined AA and BB'!$A$1:$C$6133,3,FALSE)","v":"Y"}]
[null,null,null,null,24000,2360.4308567939793,{"$f":"VLOOKUP(E725,'[1]Combined AA and BB'!$A$1:$C$6133,3,FALSE)","v":"Y"}]
[null,null,null,null,24006,2360.4308567939793,{"$f":"VLOOKUP(E726,'[1]Combined AA and BB'!$A$1:$C$6133,3,FALSE)","v":"Y"}]
[null,null,null,null,24065,485.84640000000002,{"$f":"VLOOKUP(E727,'[1]Combined AA and BB'!$A$1:$C$6133,3,FALSE)","v":"Y"}]
[null,null,null,null,24066,1789.2422303467429,{"$f":"VLOOKUP(E728,'[1]Combined AA and BB'!$A$1:$C$6133,3,FALSE)","v":"Y"}]
[null,null,null,null,24071,1789.2422303467429,{"$f":"VLOOKUP(E729,'[1]Combined AA and BB'!$A$1:$C$6133,3,FALSE)","v":"Y"}]
[null,null,null,null,24073,1789.2422303467429,{"$f":"VLOOKUP(E730,'[1]Combined AA and BB'!$A$1:$C$6133,3,FALSE)","v":"Y"}]
[null,null,null,null,24075,1062.8859418079082,{"$f":"VLOOKUP(E731,'[1]Combined AA and BB'!$A$1:$C$6133,3,FALSE)","v":"Y"}]
[null,null,null,null,24076,1789.2422303467429,{"$f":"VLOOKUP(E732,'[1]Combined AA and BB'!$A$1:$C$6133,3,FALSE)","v":"Y"}]
[null,null,null,null,24077,"Not covered","NA"]
[null,null,null,null,24100,2360.4308567939793,{"$f":"VLOOKUP(E734,'[1]Combined AA and BB'!$A$1:$C$6133,3,FALSE)","v":"Y"}]
[null,null,null,null,24101,2360.4308567939793,{"$f":"VLOOKUP(E735,'[1]Combined AA and BB'!$A$1:$C$6133,3,FALSE)","v":"Y"}]
[null,null,null,null,24102,2360.4308567939793,{"$f":"VLOOKUP(E736,'[1]Combined AA and BB'!$A$1:$C$6133,3,FALSE)","v":"Y"}]
[null,null,null,null,24105,2360.4308567939793,{"$f":"VLOOKUP(E737,'[1]Combined AA and BB'!$A$1:$C$6133,3,FALSE)","v":"Y"}]
[null,null,null,null,24110,2360.4308567939793,{"$f":"VLOOKUP(E738,'[1]Combined AA and BB'!$A$1:$C$6133,3,FALSE)","v":"Y"}]
[null,null,null,null,24115,5235.154665531295,{"$f":"VLOOKUP(E739,'[1]Combined AA and BB'!$A$1:$C$6133,3,FALSE)","v":"Y"}]
[null,null,null,null,24116,5235.154665531295,{"$f":"VLOOKUP(E740,'[1]Combined AA and BB'!$A$1:$C$6133,3,FALSE)","v":"Y"}]
[null,null,null,null,24120,2360.4308567939793,{"$f":"VLOOKUP(E741,'[1]Combined AA and BB'!$A$1:$C$6133,3,FALSE)","v":"Y"}]
[null,null,null,null,24125,2360.4308567939793,{"$f":"VLOOKUP(E742,'[1]Combined AA and BB'!$A$1:$C$6133,3,FALSE)","v":"Y"}]
[null,null,null,null,24126,10933.236684304658,{"$f":"VLOOKUP(E743,'[1]Combined AA and BB'!$A$1:$C$6133,3,FALSE)","v":"Y"}]
[null,null,null,null,24130,2360.4308567939793,{"$f":"VLOOKUP(E744,'[1]Combined AA and BB'!$A$1:$C$6133,3,FALSE)","v":"Y"}]
[null,null,null,null,24134,5235.154665531295,{"$f":"VLOOKUP(E745,'[1]Combined AA and BB'!$A$1:$C$6133,3,FALSE)","v":"Y"}]
[null,null,null,null,24136,2360.4308567939793,{"$f":"VLOOKUP(E746,'[1]Combined AA and BB'!$A$1:$C$6133,3,FALSE)","v":"Y"}]
[null,null,null,null,24138,5235.154665531295,{"$f":"VLOOKUP(E747,'[1]Combined AA and BB'!$A$1:$C$6133,3,FALSE)","v":"Y"}]
[null,null,null,null,24140,2360.4308567939793,{"$f":"VLOOKUP(E748,'[1]Combined AA and BB'!$A$1:$C$6133,3,FALSE)","v":"Y"}]
[null,null,null,null,24145,5235.154665531295,{"$f":"VLOOKUP(E749,'[1]Combined AA and BB'!$A$1:$C$6133,3,FALSE)","v":"Y"}]
[null,null,null,null,24147,2360.4308567939793,{"$f":"VLOOKUP(E750,'[1]Combined AA and BB'!$A$1:$C$6133,3,FALSE)","v":"Y"}]
[null,null,null,null,24149,5235.154665531295,{"$f":"VLOOKUP(E751,'[1]Combined AA and BB'!$A$1:$C$6133,3,FALSE)","v":"Y"}]
[null,null,null,null,24152,"Not covered","NA"]
[null,null,null,null,24155,2360.4308567939793,{"$f":"VLOOKUP(E753,'[1]Combined AA and BB'!$A$1:$C$6133,3,FALSE)","v":"Y"}]
[null,null,null,null,24160,2360.4308567939793,{"$f":"VLOOKUP(E754,'[1]Combined AA and BB'!$A$1:$C$6133,3,FALSE)","v":"N"}]
[null,null,null,null,24164,2360.4308567939793,{"$f":"VLOOKUP(E755,'[1]Combined AA and BB'!$A$1:$C$6133,3,FALSE)","v":"N"}]
[null,null,null,null,24200,405.4674,{"$f":"VLOOKUP(E756,'[1]Combined AA and BB'!$A$1:$C$6133,3,FALSE)","v":"Y"}]
[null,null,null,null,24201,1789.2422303467429,{"$f":"VLOOKUP(E757,'[1]Combined AA and BB'!$A$1:$C$6133,3,FALSE)","v":"Y"}]
[null,null,null,null,24220,"Bundled","NA"]
[null,null,null,null,24300,1248.9885183021138,{"$f":"VLOOKUP(E759,'[1]Combined AA and BB'!$A$1:$C$6133,3,FALSE)","v":"Y"}]
[null,null,null,null,24301,5235.154665531295,{"$f":"VLOOKUP(E760,'[1]Combined AA and BB'!$A$1:$C$6133,3,FALSE)","v":"Y"}]
[null,null,null,null,24305,2360.4308567939793,{"$f":"VLOOKUP(E761,'[1]Combined AA and BB'!$A$1:$C$6133,3,FALSE)","v":"Y"}]
[null,null,null,null,24310,2360.4308567939793,{"$f":"VLOOKUP(E762,'[1]Combined AA and BB'!$A$1:$C$6133,3,FALSE)","v":"Y"}]
[null,null,null,null,24320,5235.154665531295,{"$f":"VLOOKUP(E763,'[1]Combined AA and BB'!$A$1:$C$6133,3,FALSE)","v":"Y"}]
[null,null,null,null,24330,5235.154665531295,{"$f":"VLOOKUP(E764,'[1]Combined AA and BB'!$A$1:$C$6133,3,FALSE)","v":"Y"}]
[null,null,null,null,24331,5235.154665531295,{"$f":"VLOOKUP(E765,'[1]Combined AA and BB'!$A$1:$C$6133,3,FALSE)","v":"Y"}]
[null,null,null,null,24332,2360.4308567939793,{"$f":"VLOOKUP(E766,'[1]Combined AA and BB'!$A$1:$C$6133,3,FALSE)","v":"Y"}]
[null,null,null,null,24340,8854.0515688595315,{"$f":"VLOOKUP(E767,'[1]Combined AA and BB'!$A$1:$C$6133,3,FALSE)","v":"Y"}]
[null,null,null,null,24341,5235.154665531295,{"$f":"VLOOKUP(E768,'[1]Combined AA and BB'!$A$1:$C$6133,3,FALSE)","v":"Y"}]
[null,null,null,null,24342,5235.154665531295,{"$f":"VLOOKUP(E769,'[1]Combined AA and BB'!$A$1:$C$6133,3,FALSE)","v":"Y"}]
[null,null,null,null,24343,2360.4308567939793,{"$f":"VLOOKUP(E770,'[1]Combined AA and BB'!$A$1:$C$6133,3,FALSE)","v":"Y"}]
[null,null,null,null,24344,8854.0515688595315,{"$f":"VLOOKUP(E771,'[1]Combined AA and BB'!$A$1:$C$6133,3,FALSE)","v":"Y"}]
[null,null,null,null,24345,5235.154665531295,{"$f":"VLOOKUP(E772,'[1]Combined AA and BB'!$A$1:$C$6133,3,FALSE)","v":"Y"}]
[null,null,null,null,24346,10734.562359657788,{"$f":"VLOOKUP(E773,'[1]Combined AA and BB'!$A$1:$C$6133,3,FALSE)","v":"Y"}]
[null,null,null,null,24357,2360.4308567939793,{"$f":"VLOOKUP(E774,'[1]Combined AA and BB'!$A$1:$C$6133,3,FALSE)","v":"Y"}]
[null,null,null,null,24358,2360.4308567939793,{"$f":"VLOOKUP(E775,'[1]Combined AA and BB'!$A$1:$C$6133,3,FALSE)","v":"Y"}]
[null,null,null,null,24359,2360.4308567939793,{"$f":"VLOOKUP(E776,'[1]Combined AA and BB'!$A$1:$C$6133,3,FALSE)","v":"Y"}]
[null,null,null,null,24360,10139.352551811648,{"$f":"VLOOKUP(E777,'[1]Combined AA and BB'!$A$1:$C$6133,3,FALSE)","v":"Y"}]
[null,null,null,null,24361,34443.013555511236,{"$f":"VLOOKUP(E778,'[1]Combined AA and BB'!$A$1:$C$6133,3,FALSE)","v":"Y"}]
[null,null,null,null,24362,20192.414339874413,{"$f":"VLOOKUP(E779,'[1]Combined AA and BB'!$A$1:$C$6133,3,FALSE)","v":"Y"}]
[null,null,null,null,24363,35323.302276794348,{"$f":"VLOOKUP(E780,'[1]Combined AA and BB'!$A$1:$C$6133,3,FALSE)","v":"Y"}]
[null,null,null,null,24365,21594.010367441006,{"$f":"VLOOKUP(E781,'[1]Combined AA and BB'!$A$1:$C$6133,3,FALSE)","v":"Y"}]
[null,null,null,null,24366,21336.56088920961,{"$f":"VLOOKUP(E782,'[1]Combined AA and BB'!$A$1:$C$6133,3,FALSE)","v":"Y"}]
[null,null,null,null,24370,19846.545569623322,{"$f":"VLOOKUP(E783,'[1]Combined AA and BB'!$A$1:$C$6133,3,FALSE)","v":"Y"}]
[null,null,null,null,24371,32260.054149985834,{"$f":"VLOOKUP(E784,'[1]Combined AA and BB'!$A$1:$C$6133,3,FALSE)","v":"Y"}]
[null,null,null,null,24400,8854.0515688595315,{"$f":"VLOOKUP(E785,'[1]Combined AA and BB'!$A$1:$C$6133,3,FALSE)","v":"Y"}]
[null,null,null,null,24410,"Not covered","NA"]
[null,null,null,null,24420,8854.0515688595315,{"$f":"VLOOKUP(E787,'[1]Combined AA and BB'!$A$1:$C$6133,3,FALSE)","v":"Y"}]
[null,null,null,null,24430,19422.672498624161,{"$f":"VLOOKUP(E788,'[1]Combined AA and BB'!$A$1:$C$6133,3,FALSE)","v":"Y"}]
[null,null,null,null,24435,19845.247964153412,{"$f":"VLOOKUP(E789,'[1]Combined AA and BB'!$A$1:$C$6133,3,FALSE)","v":"Y"}]
[null,null,null,null,24470,2360.4308567939793,{"$f":"VLOOKUP(E790,'[1]Combined AA and BB'!$A$1:$C$6133,3,FALSE)","v":"Y"}]
[null,null,null,null,24495,5235.154665531295,{"$f":"VLOOKUP(E791,'[1]Combined AA and BB'!$A$1:$C$6133,3,FALSE)","v":"Y"}]
[null,null,null,null,24498,18797.283574649115,{"$f":"VLOOKUP(E792,'[1]Combined AA and BB'!$A$1:$C$6133,3,FALSE)","v":"Y"}]
[null,null,null,null,24500,179.82216601985061,{"$f":"VLOOKUP(E793,'[1]Combined AA and BB'!$A$1:$C$6133,3,FALSE)","v":"Y"}]
[null,null,null,null,24505,1248.9885183021138,{"$f":"VLOOKUP(E794,'[1]Combined AA and BB'!$A$1:$C$6133,3,FALSE)","v":"Y"}]
[null,null,null,null,24515,18953.314941153491,{"$f":"VLOOKUP(E795,'[1]Combined AA and BB'!$A$1:$C$6133,3,FALSE)","v":"Y"}]
[null,null,null,null,24516,19270.556713537757,{"$f":"VLOOKUP(E796,'[1]Combined AA and BB'!$A$1:$C$6133,3,FALSE)","v":"Y"}]
[null,null,null,null,24530,179.82216601985061,{"$f":"VLOOKUP(E797,'[1]Combined AA and BB'!$A$1:$C$6133,3,FALSE)","v":"Y"}]
[null,null,null,null,24535,1248.9885183021138,{"$f":"VLOOKUP(E798,'[1]Combined AA and BB'!$A$1:$C$6133,3,FALSE)","v":"Y"}]
[null,null,null,null,24538,5235.154665531295,{"$f":"VLOOKUP(E799,'[1]Combined AA and BB'!$A$1:$C$6133,3,FALSE)","v":"Y"}]
[null,null,null,null,24545,20038.966801805735,{"$f":"VLOOKUP(E800,'[1]Combined AA and BB'!$A$1:$C$6133,3,FALSE)","v":"Y"}]
[null,null,null,null,24546,20601.945455679852,{"$f":"VLOOKUP(E801,'[1]Combined AA and BB'!$A$1:$C$6133,3,FALSE)","v":"Y"}]
[null,null,null,null,24560,179.82216601985061,{"$f":"VLOOKUP(E802,'[1]Combined AA and BB'!$A$1:$C$6133,3,FALSE)","v":"Y"}]
[null,null,null,null,24565,1248.9885183021138,{"$f":"VLOOKUP(E803,'[1]Combined AA and BB'!$A$1:$C$6133,3,FALSE)","v":"Y"}]
[null,null,null,null,24566,1248.9885183021138,{"$f":"VLOOKUP(E804,'[1]Combined AA and BB'!$A$1:$C$6133,3,FALSE)","v":"Y"}]
[null,null,null,null,24575,19097.645093420455,{"$f":"VLOOKUP(E805,'[1]Combined AA and BB'!$A$1:$C$6133,3,FALSE)","v":"Y"}]
[null,null,null,null,24576,179.82216601985061,{"$f":"VLOOKUP(E806,'[1]Combined AA and BB'!$A$1:$C$6133,3,FALSE)","v":"Y"}]
[null,null,null,null,24577,1248.9885183021138,{"$f":"VLOOKUP(E807,'[1]Combined AA and BB'!$A$1:$C$6133,3,FALSE)","v":"Y"}]
[null,null,null,null,24579,18945.517925829925,{"$f":"VLOOKUP(E808,'[1]Combined AA and BB'!$A$1:$C$6133,3,FALSE)","v":"Y"}]
[null,null,null,null,24582,5235.154665531295,{"$f":"VLOOKUP(E809,'[1]Combined AA and BB'!$A$1:$C$6133,3,FALSE)","v":"Y"}]
[null,null,null,null,24586,19763.32808198738,{"$f":"VLOOKUP(E810,'[1]Combined AA and BB'!$A$1:$C$6133,3,FALSE)","v":"Y"}]
[null,null,null,null,24587,20414.726027881195,{"$f":"VLOOKUP(E811,'[1]Combined AA and BB'!$A$1:$C$6133,3,FALSE)","v":"Y"}]
[null,null,null,null,24600,179.82216601985061,{"$f":"VLOOKUP(E812,'[1]Combined AA and BB'!$A$1:$C$6133,3,FALSE)","v":"Y"}]
[null,null,null,null,24605,1248.9885183021138,{"$f":"VLOOKUP(E813,'[1]Combined AA and BB'!$A$1:$C$6133,3,FALSE)","v":"Y"}]
[null,null,null,null,24615,8878.1483300858035,{"$f":"VLOOKUP(E814,'[1]Combined AA and BB'!$A$1:$C$6133,3,FALSE)","v":"Y"}]
[null,null,null,null,24620,1248.9885183021138,{"$f":"VLOOKUP(E815,'[1]Combined AA and BB'!$A$1:$C$6133,3,FALSE)","v":"Y"}]
[null,null,null,null,24635,9538.8799293596603,{"$f":"VLOOKUP(E816,'[1]Combined AA and BB'!$A$1:$C$6133,3,FALSE)","v":"Y"}]
[null,null,null,null,24640,"Not covered","NA"]
[null,null,null,null,24650,179.82216601985061,{"$f":"VLOOKUP(E818,'[1]Combined AA and BB'!$A$1:$C$6133,3,FALSE)","v":"Y"}]
[null,null,null,null,24655,1248.9885183021138,{"$f":"VLOOKUP(E819,'[1]Combined AA and BB'!$A$1:$C$6133,3,FALSE)","v":"Y"}]
[null,null,null,null,24665,5235.154665531295,{"$f":"VLOOKUP(E820,'[1]Combined AA and BB'!$A$1:$C$6133,3,FALSE)","v":"Y"}]
[null,null,null,null,24666,21746.126152527413,{"$f":"VLOOKUP(E821,'[1]Combined AA and BB'!$A$1:$C$6133,3,FALSE)","v":"Y"}]
[null,null,null,null,24670,179.82216601985061,{"$f":"VLOOKUP(E822,'[1]Combined AA and BB'!$A$1:$C$6133,3,FALSE)","v":"Y"}]
[null,null,null,null,24675,1248.9885183021138,{"$f":"VLOOKUP(E823,'[1]Combined AA and BB'!$A$1:$C$6133,3,FALSE)","v":"Y"}]
[null,null,null,null,24685,9033.4967463428602,{"$f":"VLOOKUP(E824,'[1]Combined AA and BB'!$A$1:$C$6133,3,FALSE)","v":"Y"}]
[null,null,null,null,24800,5235.154665531295,{"$f":"VLOOKUP(E825,'[1]Combined AA and BB'!$A$1:$C$6133,3,FALSE)","v":"Y"}]
[null,null,null,null,24802,10734.562359657788,{"$f":"VLOOKUP(E826,'[1]Combined AA and BB'!$A$1:$C$6133,3,FALSE)","v":"Y"}]
[null,null,null,null,24925,2360.4308567939793,{"$f":"VLOOKUP(E827,'[1]Combined AA and BB'!$A$1:$C$6133,3,FALSE)","v":"Y"}]
[null,null,null,null,25000,1248.9885183021138,{"$f":"VLOOKUP(E828,'[1]Combined AA and BB'!$A$1:$C$6133,3,FALSE)","v":"Y"}]
[null,null,null,null,25001,2360.4308567939793,{"$f":"VLOOKUP(E829,'[1]Combined AA and BB'!$A$1:$C$6133,3,FALSE)","v":"Y"}]
[null,null,null,null,25020,1248.9885183021138,{"$f":"VLOOKUP(E830,'[1]Combined AA and BB'!$A$1:$C$6133,3,FALSE)","v":"Y"}]
[null,null,null,null,25023,2360.4308567939793,{"$f":"VLOOKUP(E831,'[1]Combined AA and BB'!$A$1:$C$6133,3,FALSE)","v":"Y"}]
[null,null,null,null,25024,2360.4308567939793,{"$f":"VLOOKUP(E832,'[1]Combined AA and BB'!$A$1:$C$6133,3,FALSE)","v":"Y"}]
[null,null,null,null,25025,1248.9885183021138,{"$f":"VLOOKUP(E833,'[1]Combined AA and BB'!$A$1:$C$6133,3,FALSE)","v":"Y"}]
[null,null,null,null,25028,2360.4308567939793,{"$f":"VLOOKUP(E834,'[1]Combined AA and BB'!$A$1:$C$6133,3,FALSE)","v":"Y"}]
[null,null,null,null,25031,1248.9885183021138,{"$f":"VLOOKUP(E835,'[1]Combined AA and BB'!$A$1:$C$6133,3,FALSE)","v":"Y"}]
[null,null,null,null,25035,5235.154665531295,{"$f":"VLOOKUP(E836,'[1]Combined AA and BB'!$A$1:$C$6133,3,FALSE)","v":"Y"}]
[null,null,null,null,25040,2360.4308567939793,{"$f":"VLOOKUP(E837,'[1]Combined AA and BB'!$A$1:$C$6133,3,FALSE)","v":"Y"}]
[null,null,null,null,25065,481.08319999999998,{"$f":"VLOOKUP(E838,'[1]Combined AA and BB'!$A$1:$C$6133,3,FALSE)","v":"Y"}]
[null,null,null,null,25066,1789.2422303467429,{"$f":"VLOOKUP(E839,'[1]Combined AA and BB'!$A$1:$C$6133,3,FALSE)","v":"Y"}]
[null,null,null,null,25071,1062.8859418079082,{"$f":"VLOOKUP(E840,'[1]Combined AA and BB'!$A$1:$C$6133,3,FALSE)","v":"Y"}]
[null,null,null,null,25073,1789.2422303467429,{"$f":"VLOOKUP(E841,'[1]Combined AA and BB'!$A$1:$C$6133,3,FALSE)","v":"Y"}]
[null,null,null,null,25075,1062.8859418079082,{"$f":"VLOOKUP(E842,'[1]Combined AA and BB'!$A$1:$C$6133,3,FALSE)","v":"Y"}]
[null,null,null,null,25076,1062.8859418079082,{"$f":"VLOOKUP(E843,'[1]Combined AA and BB'!$A$1:$C$6133,3,FALSE)","v":"Y"}]
[null,null,null,null,25077,"Not covered","NA"]
[null,null,null,null,25085,2360.4308567939793,{"$f":"VLOOKUP(E845,'[1]Combined AA and BB'!$A$1:$C$6133,3,FALSE)","v":"Y"}]
[null,null,null,null,25100,2360.4308567939793,{"$f":"VLOOKUP(E846,'[1]Combined AA and BB'!$A$1:$C$6133,3,FALSE)","v":"Y"}]
[null,null,null,null,25101,2360.4308567939793,{"$f":"VLOOKUP(E847,'[1]Combined AA and BB'!$A$1:$C$6133,3,FALSE)","v":"Y"}]
[null,null,null,null,25105,2360.4308567939793,{"$f":"VLOOKUP(E848,'[1]Combined AA and BB'!$A$1:$C$6133,3,FALSE)","v":"Y"}]
[null,null,null,null,25107,2360.4308567939793,{"$f":"VLOOKUP(E849,'[1]Combined AA and BB'!$A$1:$C$6133,3,FALSE)","v":"Y"}]
[null,null,null,null,25109,2360.4308567939793,{"$f":"VLOOKUP(E850,'[1]Combined AA and BB'!$A$1:$C$6133,3,FALSE)","v":"Y"}]
[null,null,null,null,25110,1248.9885183021138,{"$f":"VLOOKUP(E851,'[1]Combined AA and BB'!$A$1:$C$6133,3,FALSE)","v":"Y"}]
[null,null,null,null,25111,1248.9885183021138,{"$f":"VLOOKUP(E852,'[1]Combined AA and BB'!$A$1:$C$6133,3,FALSE)","v":"Y"}]
[null,null,null,null,25112,1248.9885183021138,{"$f":"VLOOKUP(E853,'[1]Combined AA and BB'!$A$1:$C$6133,3,FALSE)","v":"Y"}]
[null,null,null,null,25115,1248.9885183021138,{"$f":"VLOOKUP(E854,'[1]Combined AA and BB'!$A$1:$C$6133,3,FALSE)","v":"Y"}]
[null,null,null,null,25116,2360.4308567939793,{"$f":"VLOOKUP(E855,'[1]Combined AA and BB'!$A$1:$C$6133,3,FALSE)","v":"Y"}]
[null,null,null,null,25118,1248.9885183021138,{"$f":"VLOOKUP(E856,'[1]Combined AA and BB'!$A$1:$C$6133,3,FALSE)","v":"Y"}]
[null,null,null,null,25119,2360.4308567939793,{"$f":"VLOOKUP(E857,'[1]Combined AA and BB'!$A$1:$C$6133,3,FALSE)","v":"Y"}]
[null,null,null,null,25120,2360.4308567939793,{"$f":"VLOOKUP(E858,'[1]Combined AA and BB'!$A$1:$C$6133,3,FALSE)","v":"Y"}]
[null,null,null,null,25125,1248.9885183021138,{"$f":"VLOOKUP(E859,'[1]Combined AA and BB'!$A$1:$C$6133,3,FALSE)","v":"Y"}]
[null,null,null,null,25126,3992.1287581884499,{"$f":"VLOOKUP(E860,'[1]Combined AA and BB'!$A$1:$C$6133,3,FALSE)","v":"Y"}]
[null,null,null,null,25130,2360.4308567939793,{"$f":"VLOOKUP(E861,'[1]Combined AA and BB'!$A$1:$C$6133,3,FALSE)","v":"Y"}]
[null,null,null,null,25135,5235.154665531295,{"$f":"VLOOKUP(E862,'[1]Combined AA and BB'!$A$1:$C$6133,3,FALSE)","v":"Y"}]
[null,null,null,null,25136,5235.154665531295,{"$f":"VLOOKUP(E863,'[1]Combined AA and BB'!$A$1:$C$6133,3,FALSE)","v":"Y"}]
[null,null,null,null,25145,2360.4308567939793,{"$f":"VLOOKUP(E864,'[1]Combined AA and BB'!$A$1:$C$6133,3,FALSE)","v":"Y"}]
[null,null,null,null,25150,2360.4308567939793,{"$f":"VLOOKUP(E865,'[1]Combined AA and BB'!$A$1:$C$6133,3,FALSE)","v":"Y"}]
[null,null,null,null,25151,2360.4308567939793,{"$f":"VLOOKUP(E866,'[1]Combined AA and BB'!$A$1:$C$6133,3,FALSE)","v":"Y"}]
[null,null,null,null,25210,2360.4308567939793,{"$f":"VLOOKUP(E867,'[1]Combined AA and BB'!$A$1:$C$6133,3,FALSE)","v":"Y"}]
[null,null,null,null,25215,2360.4308567939793,{"$f":"VLOOKUP(E868,'[1]Combined AA and BB'!$A$1:$C$6133,3,FALSE)","v":"Y"}]
[null,null,null,null,25230,2360.4308567939793,{"$f":"VLOOKUP(E869,'[1]Combined AA and BB'!$A$1:$C$6133,3,FALSE)","v":"Y"}]
[null,null,null,null,25240,2360.4308567939793,{"$f":"VLOOKUP(E870,'[1]Combined AA and BB'!$A$1:$C$6133,3,FALSE)","v":"Y"}]
[null,null,null,null,25246,"Bundled","NA"]
[null,null,null,null,25248,1248.9885183021138,{"$f":"VLOOKUP(E872,'[1]Combined AA and BB'!$A$1:$C$6133,3,FALSE)","v":"Y"}]
[null,null,null,null,25250,1248.9885183021138,{"$f":"VLOOKUP(E873,'[1]Combined AA and BB'!$A$1:$C$6133,3,FALSE)","v":"N"}]
[null,null,null,null,25251,2360.4308567939793,{"$f":"VLOOKUP(E874,'[1]Combined AA and BB'!$A$1:$C$6133,3,FALSE)","v":"N"}]
[null,null,null,null,25259,1248.9885183021138,{"$f":"VLOOKUP(E875,'[1]Combined AA and BB'!$A$1:$C$6133,3,FALSE)","v":"Y"}]
[null,null,null,null,25260,2360.4308567939793,{"$f":"VLOOKUP(E876,'[1]Combined AA and BB'!$A$1:$C$6133,3,FALSE)","v":"Y"}]
[null,null,null,null,25263,5235.154665531295,{"$f":"VLOOKUP(E877,'[1]Combined AA and BB'!$A$1:$C$6133,3,FALSE)","v":"Y"}]
[null,null,null,null,25265,2360.4308567939793,{"$f":"VLOOKUP(E878,'[1]Combined AA and BB'!$A$1:$C$6133,3,FALSE)","v":"Y"}]
[null,null,null,null,25270,2360.4308567939793,{"$f":"VLOOKUP(E879,'[1]Combined AA and BB'!$A$1:$C$6133,3,FALSE)","v":"Y"}]
[null,null,null,null,25272,2360.4308567939793,{"$f":"VLOOKUP(E880,'[1]Combined AA and BB'!$A$1:$C$6133,3,FALSE)","v":"Y"}]
[null,null,null,null,25274,2360.4308567939793,{"$f":"VLOOKUP(E881,'[1]Combined AA and BB'!$A$1:$C$6133,3,FALSE)","v":"Y"}]
[null,null,null,null,25275,2360.4308567939793,{"$f":"VLOOKUP(E882,'[1]Combined AA and BB'!$A$1:$C$6133,3,FALSE)","v":"Y"}]
[null,null,null,null,25280,2360.4308567939793,{"$f":"VLOOKUP(E883,'[1]Combined AA and BB'!$A$1:$C$6133,3,FALSE)","v":"Y"}]
[null,null,null,null,25290,2360.4308567939793,{"$f":"VLOOKUP(E884,'[1]Combined AA and BB'!$A$1:$C$6133,3,FALSE)","v":"Y"}]
[null,null,null,null,25295,2360.4308567939793,{"$f":"VLOOKUP(E885,'[1]Combined AA and BB'!$A$1:$C$6133,3,FALSE)","v":"Y"}]
[null,null,null,null,25300,2360.4308567939793,{"$f":"VLOOKUP(E886,'[1]Combined AA and BB'!$A$1:$C$6133,3,FALSE)","v":"Y"}]
[null,null,null,null,25301,2360.4308567939793,{"$f":"VLOOKUP(E887,'[1]Combined AA and BB'!$A$1:$C$6133,3,FALSE)","v":"Y"}]
[null,null,null,null,25310,2360.4308567939793,{"$f":"VLOOKUP(E888,'[1]Combined AA and BB'!$A$1:$C$6133,3,FALSE)","v":"Y"}]
[null,null,null,null,25312,2360.4308567939793,{"$f":"VLOOKUP(E889,'[1]Combined AA and BB'!$A$1:$C$6133,3,FALSE)","v":"Y"}]
[null,null,null,null,25315,5235.154665531295,{"$f":"VLOOKUP(E890,'[1]Combined AA and BB'!$A$1:$C$6133,3,FALSE)","v":"Y"}]
[null,null,null,null,25316,5235.154665531295,{"$f":"VLOOKUP(E891,'[1]Combined AA and BB'!$A$1:$C$6133,3,FALSE)","v":"Y"}]
[null,null,null,null,25320,5235.154665531295,{"$f":"VLOOKUP(E892,'[1]Combined AA and BB'!$A$1:$C$6133,3,FALSE)","v":"Y"}]
[null,null,null,null,25332,4117.3363035304501,{"$f":"VLOOKUP(E893,'[1]Combined AA and BB'!$A$1:$C$6133,3,FALSE)","v":"Y"}]
[null,null,null,null,25335,"Not covered","NA"]
[null,null,null,null,25337,5235.154665531295,{"$f":"VLOOKUP(E895,'[1]Combined AA and BB'!$A$1:$C$6133,3,FALSE)","v":"Y"}]
[null,null,null,null,25350,9737.9713089575598,{"$f":"VLOOKUP(E896,'[1]Combined AA and BB'!$A$1:$C$6133,3,FALSE)","v":"Y"}]
[null,null,null,null,25355,2360.4308567939793,{"$f":"VLOOKUP(E897,'[1]Combined AA and BB'!$A$1:$C$6133,3,FALSE)","v":"Y"}]
[null,null,null,null,25360,5235.154665531295,{"$f":"VLOOKUP(E898,'[1]Combined AA and BB'!$A$1:$C$6133,3,FALSE)","v":"Y"}]
[null,null,null,null,25365,10734.562359657788,{"$f":"VLOOKUP(E899,'[1]Combined AA and BB'!$A$1:$C$6133,3,FALSE)","v":"Y"}]
[null,null,null,null,25370,2360.4308567939793,{"$f":"VLOOKUP(E900,'[1]Combined AA and BB'!$A$1:$C$6133,3,FALSE)","v":"Y"}]
[null,null,null,null,25375,2360.4308567939793,{"$f":"VLOOKUP(E901,'[1]Combined AA and BB'!$A$1:$C$6133,3,FALSE)","v":"Y"}]
[null,null,null,null,25390,9352.445894345421,{"$f":"VLOOKUP(E902,'[1]Combined AA and BB'!$A$1:$C$6133,3,FALSE)","v":"Y"}]
[null,null,null,null,25391,21148.032473436921,{"$f":"VLOOKUP(E903,'[1]Combined AA and BB'!$A$1:$C$6133,3,FALSE)","v":"Y"}]
[null,null,null,null,25392,5235.154665531295,{"$f":"VLOOKUP(E904,'[1]Combined AA and BB'!$A$1:$C$6133,3,FALSE)","v":"Y"}]
[null,null,null,null,25393,8943.4611387378391,{"$f":"VLOOKUP(E905,'[1]Combined AA and BB'!$A$1:$C$6133,3,FALSE)","v":"Y"}]
[null,null,null,null,25394,2360.4308567939793,{"$f":"VLOOKUP(E906,'[1]Combined AA and BB'!$A$1:$C$6133,3,FALSE)","v":"Y"}]
[null,null,null,null,25400,9585.1498086155898,{"$f":"VLOOKUP(E907,'[1]Combined AA and BB'!$A$1:$C$6133,3,FALSE)","v":"Y"}]
[null,null,null,null,25405,9473.5557382035022,{"$f":"VLOOKUP(E908,'[1]Combined AA and BB'!$A$1:$C$6133,3,FALSE)","v":"Y"}]
[null,null,null,null,25415,9334.0745326925135,{"$f":"VLOOKUP(E909,'[1]Combined AA and BB'!$A$1:$C$6133,3,FALSE)","v":"Y"}]
[null,null,null,null,25420,8843.2723374559973,{"$f":"VLOOKUP(E910,'[1]Combined AA and BB'!$A$1:$C$6133,3,FALSE)","v":"Y"}]
[null,null,null,null,25425,5235.154665531295,{"$f":"VLOOKUP(E911,'[1]Combined AA and BB'!$A$1:$C$6133,3,FALSE)","v":"Y"}]
[null,null,null,null,25426,4163.9362754059175,{"$f":"VLOOKUP(E912,'[1]Combined AA and BB'!$A$1:$C$6133,3,FALSE)","v":"Y"}]
[null,null,null,null,25430,2360.4308567939793,{"$f":"VLOOKUP(E913,'[1]Combined AA and BB'!$A$1:$C$6133,3,FALSE)","v":"Y"}]
[null,null,null,null,25431,5235.154665531295,{"$f":"VLOOKUP(E914,'[1]Combined AA and BB'!$A$1:$C$6133,3,FALSE)","v":"Y"}]
[null,null,null,null,25440,5235.154665531295,{"$f":"VLOOKUP(E915,'[1]Combined AA and BB'!$A$1:$C$6133,3,FALSE)","v":"Y"}]
[null,null,null,null,25441,22011.361263578256,{"$f":"VLOOKUP(E916,'[1]Combined AA and BB'!$A$1:$C$6133,3,FALSE)","v":"Y"}]
[null,null,null,null,25442,35806.330221715551,{"$f":"VLOOKUP(E917,'[1]Combined AA and BB'!$A$1:$C$6133,3,FALSE)","v":"Y"}]
[null,null,null,null,25443,10110.201958755206,{"$f":"VLOOKUP(E918,'[1]Combined AA and BB'!$A$1:$C$6133,3,FALSE)","v":"Y"}]
[null,null,null,null,25444,22540.533880210038,{"$f":"VLOOKUP(E919,'[1]Combined AA and BB'!$A$1:$C$6133,3,FALSE)","v":"Y"}]
[null,null,null,null,25445,10072.77628520207,{"$f":"VLOOKUP(E920,'[1]Combined AA and BB'!$A$1:$C$6133,3,FALSE)","v":"Y"}]
[null,null,null,null,25446,36425.242500845176,{"$f":"VLOOKUP(E921,'[1]Combined AA and BB'!$A$1:$C$6133,3,FALSE)","v":"Y"}]
[null,null,null,null,25447,2360.4308567939793,{"$f":"VLOOKUP(E922,'[1]Combined AA and BB'!$A$1:$C$6133,3,FALSE)","v":"Y"}]
[null,null,null,null,25449,5235.154665531295,{"$f":"VLOOKUP(E923,'[1]Combined AA and BB'!$A$1:$C$6133,3,FALSE)","v":"Y"}]
[null,null,null,null,25450,2360.4308567939793,{"$f":"VLOOKUP(E924,'[1]Combined AA and BB'!$A$1:$C$6133,3,FALSE)","v":"Y"}]
[null,null,null,null,25455,2360.4308567939793,{"$f":"VLOOKUP(E925,'[1]Combined AA and BB'!$A$1:$C$6133,3,FALSE)","v":"Y"}]
[null,null,null,null,25490,5235.154665531295,{"$f":"VLOOKUP(E926,'[1]Combined AA and BB'!$A$1:$C$6133,3,FALSE)","v":"Y"}]
[null,null,null,null,25491,10734.562359657788,{"$f":"VLOOKUP(E927,'[1]Combined AA and BB'!$A$1:$C$6133,3,FALSE)","v":"Y"}]
[null,null,null,null,25492,2360.4308567939793,{"$f":"VLOOKUP(E928,'[1]Combined AA and BB'!$A$1:$C$6133,3,FALSE)","v":"Y"}]
[null,null,null,null,25500,179.82216601985061,{"$f":"VLOOKUP(E929,'[1]Combined AA and BB'!$A$1:$C$6133,3,FALSE)","v":"Y"}]
[null,null,null,null,25505,1248.9885183021138,{"$f":"VLOOKUP(E930,'[1]Combined AA and BB'!$A$1:$C$6133,3,FALSE)","v":"Y"}]
[null,null,null,null,25515,9133.6855476247038,{"$f":"VLOOKUP(E931,'[1]Combined AA and BB'!$A$1:$C$6133,3,FALSE)","v":"Y"}]
[null,null,null,null,25520,1248.9885183021138,{"$f":"VLOOKUP(E932,'[1]Combined AA and BB'!$A$1:$C$6133,3,FALSE)","v":"Y"}]
[null,null,null,null,25525,8832.4931060524614,{"$f":"VLOOKUP(E933,'[1]Combined AA and BB'!$A$1:$C$6133,3,FALSE)","v":"Y"}]
[null,null,null,null,25526,9058.2423103040892,{"$f":"VLOOKUP(E934,'[1]Combined AA and BB'!$A$1:$C$6133,3,FALSE)","v":"Y"}]
[null,null,null,null,25530,179.82216601985061,{"$f":"VLOOKUP(E935,'[1]Combined AA and BB'!$A$1:$C$6133,3,FALSE)","v":"Y"}]
[null,null,null,null,25535,179.82216601985061,{"$f":"VLOOKUP(E936,'[1]Combined AA and BB'!$A$1:$C$6133,3,FALSE)","v":"Y"}]
[null,null,null,null,25545,9056.9674698424224,{"$f":"VLOOKUP(E937,'[1]Combined AA and BB'!$A$1:$C$6133,3,FALSE)","v":"Y"}]
[null,null,null,null,25560,179.82216601985061,{"$f":"VLOOKUP(E938,'[1]Combined AA and BB'!$A$1:$C$6133,3,FALSE)","v":"Y"}]
[null,null,null,null,25565,1248.9885183021138,{"$f":"VLOOKUP(E939,'[1]Combined AA and BB'!$A$1:$C$6133,3,FALSE)","v":"Y"}]
[null,null,null,null,25574,9296.6488591393772,{"$f":"VLOOKUP(E940,'[1]Combined AA and BB'!$A$1:$C$6133,3,FALSE)","v":"Y"}]
[null,null,null,null,25575,9398.1011183787632,{"$f":"VLOOKUP(E941,'[1]Combined AA and BB'!$A$1:$C$6133,3,FALSE)","v":"Y"}]
[null,null,null,null,25600,179.82216601985061,{"$f":"VLOOKUP(E942,'[1]Combined AA and BB'!$A$1:$C$6133,3,FALSE)","v":"Y"}]
[null,null,null,null,25605,1248.9885183021138,{"$f":"VLOOKUP(E943,'[1]Combined AA and BB'!$A$1:$C$6133,3,FALSE)","v":"Y"}]
[null,null,null,null,25606,2360.4308567939793,{"$f":"VLOOKUP(E944,'[1]Combined AA and BB'!$A$1:$C$6133,3,FALSE)","v":"Y"}]
[null,null,null,null,25607,9672.0324625788162,{"$f":"VLOOKUP(E945,'[1]Combined AA and BB'!$A$1:$C$6133,3,FALSE)","v":"Y"}]
[null,null,null,null,25608,9682.8116939823485,{"$f":"VLOOKUP(E946,'[1]Combined AA and BB'!$A$1:$C$6133,3,FALSE)","v":"Y"}]
[null,null,null,null,25609,9696.7552615318,{"$f":"VLOOKUP(E947,'[1]Combined AA and BB'!$A$1:$C$6133,3,FALSE)","v":"Y"}]
[null,null,null,null,25622,179.82216601985061,{"$f":"VLOOKUP(E948,'[1]Combined AA and BB'!$A$1:$C$6133,3,FALSE)","v":"Y"}]
[null,null,null,null,25624,1248.9885183021138,{"$f":"VLOOKUP(E949,'[1]Combined AA and BB'!$A$1:$C$6133,3,FALSE)","v":"Y"}]
[null,null,null,null,25628,5235.154665531295,{"$f":"VLOOKUP(E950,'[1]Combined AA and BB'!$A$1:$C$6133,3,FALSE)","v":"Y"}]
[null,null,null,null,25630,179.82216601985061,{"$f":"VLOOKUP(E951,'[1]Combined AA and BB'!$A$1:$C$6133,3,FALSE)","v":"Y"}]
[null,null,null,null,25635,1248.9885183021138,{"$f":"VLOOKUP(E952,'[1]Combined AA and BB'!$A$1:$C$6133,3,FALSE)","v":"Y"}]
[null,null,null,null,25645,2360.4308567939793,{"$f":"VLOOKUP(E953,'[1]Combined AA and BB'!$A$1:$C$6133,3,FALSE)","v":"Y"}]
[null,null,null,null,25650,179.82216601985061,{"$f":"VLOOKUP(E954,'[1]Combined AA and BB'!$A$1:$C$6133,3,FALSE)","v":"Y"}]
[null,null,null,null,25651,2360.4308567939793,{"$f":"VLOOKUP(E955,'[1]Combined AA and BB'!$A$1:$C$6133,3,FALSE)","v":"Y"}]
[null,null,null,null,25652,9460.8870111157175,{"$f":"VLOOKUP(E956,'[1]Combined AA and BB'!$A$1:$C$6133,3,FALSE)","v":"Y"}]
[null,null,null,null,25660,179.82216601985061,{"$f":"VLOOKUP(E957,'[1]Combined AA and BB'!$A$1:$C$6133,3,FALSE)","v":"Y"}]
[null,null,null,null,25670,5235.154665531295,{"$f":"VLOOKUP(E958,'[1]Combined AA and BB'!$A$1:$C$6133,3,FALSE)","v":"Y"}]
[null,null,null,null,25671,2360.4308567939793,{"$f":"VLOOKUP(E959,'[1]Combined AA and BB'!$A$1:$C$6133,3,FALSE)","v":"Y"}]
[null,null,null,null,25675,179.82216601985061,{"$f":"VLOOKUP(E960,'[1]Combined AA and BB'!$A$1:$C$6133,3,FALSE)","v":"Y"}]
[null,null,null,null,25676,5235.154665531295,{"$f":"VLOOKUP(E961,'[1]Combined AA and BB'!$A$1:$C$6133,3,FALSE)","v":"Y"}]
[null,null,null,null,25680,179.82216601985061,{"$f":"VLOOKUP(E962,'[1]Combined AA and BB'!$A$1:$C$6133,3,FALSE)","v":"Y"}]
[null,null,null,null,25685,5235.154665531295,{"$f":"VLOOKUP(E963,'[1]Combined AA and BB'!$A$1:$C$6133,3,FALSE)","v":"Y"}]
[null,null,null,null,25690,1248.9885183021138,{"$f":"VLOOKUP(E964,'[1]Combined AA and BB'!$A$1:$C$6133,3,FALSE)","v":"Y"}]
[null,null,null,null,25695,5235.154665531295,{"$f":"VLOOKUP(E965,'[1]Combined AA and BB'!$A$1:$C$6133,3,FALSE)","v":"Y"}]
[null,null,null,null,25800,9824.8311979125447,{"$f":"VLOOKUP(E966,'[1]Combined AA and BB'!$A$1:$C$6133,3,FALSE)","v":"Y"}]
[null,null,null,null,25805,8884.4997673858797,{"$f":"VLOOKUP(E967,'[1]Combined AA and BB'!$A$1:$C$6133,3,FALSE)","v":"Y"}]
[null,null,null,null,25810,19478.583358871427,{"$f":"VLOOKUP(E968,'[1]Combined AA and BB'!$A$1:$C$6133,3,FALSE)","v":"Y"}]
[null,null,null,null,25820,9900.9346204722369,{"$f":"VLOOKUP(E969,'[1]Combined AA and BB'!$A$1:$C$6133,3,FALSE)","v":"Y"}]
[null,null,null,null,25825,9385.421008786856,{"$f":"VLOOKUP(E970,'[1]Combined AA and BB'!$A$1:$C$6133,3,FALSE)","v":"Y"}]
[null,null,null,null,25830,5235.154665531295,{"$f":"VLOOKUP(E971,'[1]Combined AA and BB'!$A$1:$C$6133,3,FALSE)","v":"Y"}]
[null,null,null,null,25907,2360.4308567939793,{"$f":"VLOOKUP(E972,'[1]Combined AA and BB'!$A$1:$C$6133,3,FALSE)","v":"Y"}]
[null,null,null,null,25922,1248.9885183021138,{"$f":"VLOOKUP(E973,'[1]Combined AA and BB'!$A$1:$C$6133,3,FALSE)","v":"Y"}]
[null,null,null,null,25929,1499.1841543066416,{"$f":"VLOOKUP(E974,'[1]Combined AA and BB'!$A$1:$C$6133,3,FALSE)","v":"Y"}]
[null,null,null,null,25931,2360.4308567939793,{"$f":"VLOOKUP(E975,'[1]Combined AA and BB'!$A$1:$C$6133,3,FALSE)","v":"Y"}]
[null,null,null,null,25999,"UR/BR","N"]
[null,null,null,null,26010,156.86319990561176,{"$f":"VLOOKUP(E977,'[1]Combined AA and BB'!$A$1:$C$6133,3,FALSE)","v":"Y"}]
[null,null,null,null,26011,1062.8859418079082,{"$f":"VLOOKUP(E978,'[1]Combined AA and BB'!$A$1:$C$6133,3,FALSE)","v":"Y"}]
[null,null,null,null,26020,2360.4308567939793,{"$f":"VLOOKUP(E979,'[1]Combined AA and BB'!$A$1:$C$6133,3,FALSE)","v":"Y"}]
[null,null,null,null,26025,2360.4308567939793,{"$f":"VLOOKUP(E980,'[1]Combined AA and BB'!$A$1:$C$6133,3,FALSE)","v":"Y"}]
[null,null,null,null,26030,2360.4308567939793,{"$f":"VLOOKUP(E981,'[1]Combined AA and BB'!$A$1:$C$6133,3,FALSE)","v":"Y"}]
[null,null,null,null,26034,1248.9885183021138,{"$f":"VLOOKUP(E982,'[1]Combined AA and BB'!$A$1:$C$6133,3,FALSE)","v":"Y"}]
[null,null,null,null,26035,2360.4308567939793,{"$f":"VLOOKUP(E983,'[1]Combined AA and BB'!$A$1:$C$6133,3,FALSE)","v":"Y"}]
[null,null,null,null,26040,1248.9885183021138,{"$f":"VLOOKUP(E984,'[1]Combined AA and BB'!$A$1:$C$6133,3,FALSE)","v":"Y"}]
[null,null,null,null,26045,2360.4308567939793,{"$f":"VLOOKUP(E985,'[1]Combined AA and BB'!$A$1:$C$6133,3,FALSE)","v":"Y"}]
[null,null,null,null,26055,1248.9885183021138,{"$f":"VLOOKUP(E986,'[1]Combined AA and BB'!$A$1:$C$6133,3,FALSE)","v":"Y"}]
[null,null,null,null,26060,1248.9885183021138,{"$f":"VLOOKUP(E987,'[1]Combined AA and BB'!$A$1:$C$6133,3,FALSE)","v":"Y"}]
[null,null,null,null,26070,1248.9885183021138,{"$f":"VLOOKUP(E988,'[1]Combined AA and BB'!$A$1:$C$6133,3,FALSE)","v":"Y"}]
[null,null,null,null,26075,2360.4308567939793,{"$f":"VLOOKUP(E989,'[1]Combined AA and BB'!$A$1:$C$6133,3,FALSE)","v":"Y"}]
[null,null,null,null,26080,1248.9885183021138,{"$f":"VLOOKUP(E990,'[1]Combined AA and BB'!$A$1:$C$6133,3,FALSE)","v":"Y"}]
[null,null,null,null,26100,2360.4308567939793,{"$f":"VLOOKUP(E991,'[1]Combined AA and BB'!$A$1:$C$6133,3,FALSE)","v":"Y"}]
[null,null,null,null,26105,2360.4308567939793,{"$f":"VLOOKUP(E992,'[1]Combined AA and BB'!$A$1:$C$6133,3,FALSE)","v":"Y"}]
[null,null,null,null,26110,1248.9885183021138,{"$f":"VLOOKUP(E993,'[1]Combined AA and BB'!$A$1:$C$6133,3,FALSE)","v":"Y"}]
[null,null,null,null,26111,1062.8859418079082,{"$f":"VLOOKUP(E994,'[1]Combined AA and BB'!$A$1:$C$6133,3,FALSE)","v":"Y"}]
[null,null,null,null,26113,1062.8859418079082,{"$f":"VLOOKUP(E995,'[1]Combined AA and BB'!$A$1:$C$6133,3,FALSE)","v":"Y"}]
[null,null,null,null,26115,1062.8859418079082,{"$f":"VLOOKUP(E996,'[1]Combined AA and BB'!$A$1:$C$6133,3,FALSE)","v":"Y"}]
[null,null,null,null,26116,1062.8859418079082,{"$f":"VLOOKUP(E997,'[1]Combined AA and BB'!$A$1:$C$6133,3,FALSE)","v":"Y"}]
[null,null,null,null,26117,"Not covered","NA"]
[null,null,null,null,26121,2360.4308567939793,{"$f":"VLOOKUP(E999,'[1]Combined AA and BB'!$A$1:$C$6133,3,FALSE)","v":"Y"}]
[null,null,null,null,26123,2360.4308567939793,{"$f":"VLOOKUP(E1000,'[1]Combined AA and BB'!$A$1:$C$6133,3,FALSE)","v":"Y"}]
[null,null,null,null,26125,"Bundled","NA"]
[null,null,null,null,26130,2360.4308567939793,{"$f":"VLOOKUP(E1002,'[1]Combined AA and BB'!$A$1:$C$6133,3,FALSE)","v":"Y"}]
[null,null,null,null,26135,2360.4308567939793,{"$f":"VLOOKUP(E1003,'[1]Combined AA and BB'!$A$1:$C$6133,3,FALSE)","v":"Y"}]
[null,null,null,null,26140,1248.9885183021138,{"$f":"VLOOKUP(E1004,'[1]Combined AA and BB'!$A$1:$C$6133,3,FALSE)","v":"Y"}]
[null,null,null,null,26145,1248.9885183021138,{"$f":"VLOOKUP(E1005,'[1]Combined AA and BB'!$A$1:$C$6133,3,FALSE)","v":"Y"}]
[null,null,null,null,26160,1248.9885183021138,{"$f":"VLOOKUP(E1006,'[1]Combined AA and BB'!$A$1:$C$6133,3,FALSE)","v":"Y"}]
[null,null,null,null,26170,1248.9885183021138,{"$f":"VLOOKUP(E1007,'[1]Combined AA and BB'!$A$1:$C$6133,3,FALSE)","v":"Y"}]
[null,null,null,null,26180,1248.9885183021138,{"$f":"VLOOKUP(E1008,'[1]Combined AA and BB'!$A$1:$C$6133,3,FALSE)","v":"Y"}]
[null,null,null,null,26185,1248.9885183021138,{"$f":"VLOOKUP(E1009,'[1]Combined AA and BB'!$A$1:$C$6133,3,FALSE)","v":"Y"}]
[null,null,null,null,26200,1248.9885183021138,{"$f":"VLOOKUP(E1010,'[1]Combined AA and BB'!$A$1:$C$6133,3,FALSE)","v":"Y"}]
[null,null,null,null,26205,5235.154665531295,{"$f":"VLOOKUP(E1011,'[1]Combined AA and BB'!$A$1:$C$6133,3,FALSE)","v":"Y"}]
[null,null,null,null,26210,1248.9885183021138,{"$f":"VLOOKUP(E1012,'[1]Combined AA and BB'!$A$1:$C$6133,3,FALSE)","v":"Y"}]
[null,null,null,null,26215,2360.4308567939793,{"$f":"VLOOKUP(E1013,'[1]Combined AA and BB'!$A$1:$C$6133,3,FALSE)","v":"Y"}]
[null,null,null,null,26230,2360.4308567939793,{"$f":"VLOOKUP(E1014,'[1]Combined AA and BB'!$A$1:$C$6133,3,FALSE)","v":"Y"}]
[null,null,null,null,26235,1248.9885183021138,{"$f":"VLOOKUP(E1015,'[1]Combined AA and BB'!$A$1:$C$6133,3,FALSE)","v":"Y"}]
[null,null,null,null,26236,1248.9885183021138,{"$f":"VLOOKUP(E1016,'[1]Combined AA and BB'!$A$1:$C$6133,3,FALSE)","v":"Y"}]
[null,null,null,null,26250,2360.4308567939793,{"$f":"VLOOKUP(E1017,'[1]Combined AA and BB'!$A$1:$C$6133,3,FALSE)","v":"Y"}]
[null,null,null,null,26260,2360.4308567939793,{"$f":"VLOOKUP(E1018,'[1]Combined AA and BB'!$A$1:$C$6133,3,FALSE)","v":"Y"}]
[null,null,null,null,26262,1248.9885183021138,{"$f":"VLOOKUP(E1019,'[1]Combined AA and BB'!$A$1:$C$6133,3,FALSE)","v":"Y"}]
[null,null,null,null,26320,1062.8859418079082,{"$f":"VLOOKUP(E1020,'[1]Combined AA and BB'!$A$1:$C$6133,3,FALSE)","v":"N"}]
[null,null,null,null,26340,1248.9885183021138,{"$f":"VLOOKUP(E1021,'[1]Combined AA and BB'!$A$1:$C$6133,3,FALSE)","v":"Y"}]
[null,null,null,null,26341,221.4888,{"$f":"VLOOKUP(E1022,'[1]Combined AA and BB'!$A$1:$C$6133,3,FALSE)","v":"Y"}]
[null,null,null,null,26350,2360.4308567939793,{"$f":"VLOOKUP(E1023,'[1]Combined AA and BB'!$A$1:$C$6133,3,FALSE)","v":"Y"}]
[null,null,null,null,26352,5235.154665531295,{"$f":"VLOOKUP(E1024,'[1]Combined AA and BB'!$A$1:$C$6133,3,FALSE)","v":"Y"}]
[null,null,null,null,26356,2360.4308567939793,{"$f":"VLOOKUP(E1025,'[1]Combined AA and BB'!$A$1:$C$6133,3,FALSE)","v":"Y"}]
[null,null,null,null,26357,2360.4308567939793,{"$f":"VLOOKUP(E1026,'[1]Combined AA and BB'!$A$1:$C$6133,3,FALSE)","v":"Y"}]
[null,null,null,null,26358,5235.154665531295,{"$f":"VLOOKUP(E1027,'[1]Combined AA and BB'!$A$1:$C$6133,3,FALSE)","v":"Y"}]
[null,null,null,null,26370,2360.4308567939793,{"$f":"VLOOKUP(E1028,'[1]Combined AA and BB'!$A$1:$C$6133,3,FALSE)","v":"Y"}]
[null,null,null,null,26372,8904.1459695004523,{"$f":"VLOOKUP(E1029,'[1]Combined AA and BB'!$A$1:$C$6133,3,FALSE)","v":"Y"}]
[null,null,null,null,26373,2360.4308567939793,{"$f":"VLOOKUP(E1030,'[1]Combined AA and BB'!$A$1:$C$6133,3,FALSE)","v":"Y"}]
[null,null,null,null,26390,5235.154665531295,{"$f":"VLOOKUP(E1031,'[1]Combined AA and BB'!$A$1:$C$6133,3,FALSE)","v":"Y"}]
[null,null,null,null,26392,5235.154665531295,{"$f":"VLOOKUP(E1032,'[1]Combined AA and BB'!$A$1:$C$6133,3,FALSE)","v":"Y"}]
[null,null,null,null,26410,1248.9885183021138,{"$f":"VLOOKUP(E1033,'[1]Combined AA and BB'!$A$1:$C$6133,3,FALSE)","v":"Y"}]
[null,null,null,null,26412,2360.4308567939793,{"$f":"VLOOKUP(E1034,'[1]Combined AA and BB'!$A$1:$C$6133,3,FALSE)","v":"Y"}]
[null,null,null,null,26415,2360.4308567939793,{"$f":"VLOOKUP(E1035,'[1]Combined AA and BB'!$A$1:$C$6133,3,FALSE)","v":"Y"}]
[null,null,null,null,26416,2360.4308567939793,{"$f":"VLOOKUP(E1036,'[1]Combined AA and BB'!$A$1:$C$6133,3,FALSE)","v":"Y"}]
[null,null,null,null,26418,1248.9885183021138,{"$f":"VLOOKUP(E1037,'[1]Combined AA and BB'!$A$1:$C$6133,3,FALSE)","v":"Y"}]
[null,null,null,null,26420,2360.4308567939793,{"$f":"VLOOKUP(E1038,'[1]Combined AA and BB'!$A$1:$C$6133,3,FALSE)","v":"Y"}]
[null,null,null,null,26426,2360.4308567939793,{"$f":"VLOOKUP(E1039,'[1]Combined AA and BB'!$A$1:$C$6133,3,FALSE)","v":"Y"}]
[null,null,null,null,26428,2360.4308567939793,{"$f":"VLOOKUP(E1040,'[1]Combined AA and BB'!$A$1:$C$6133,3,FALSE)","v":"Y"}]
[null,null,null,null,26432,1248.9885183021138,{"$f":"VLOOKUP(E1041,'[1]Combined AA and BB'!$A$1:$C$6133,3,FALSE)","v":"Y"}]
[null,null,null,null,26433,2360.4308567939793,{"$f":"VLOOKUP(E1042,'[1]Combined AA and BB'!$A$1:$C$6133,3,FALSE)","v":"Y"}]
[null,null,null,null,26434,2360.4308567939793,{"$f":"VLOOKUP(E1043,'[1]Combined AA and BB'!$A$1:$C$6133,3,FALSE)","v":"Y"}]
[null,null,null,null,26437,2360.4308567939793,{"$f":"VLOOKUP(E1044,'[1]Combined AA and BB'!$A$1:$C$6133,3,FALSE)","v":"Y"}]
[null,null,null,null,26440,1248.9885183021138,{"$f":"VLOOKUP(E1045,'[1]Combined AA and BB'!$A$1:$C$6133,3,FALSE)","v":"Y"}]
[null,null,null,null,26442,2360.4308567939793,{"$f":"VLOOKUP(E1046,'[1]Combined AA and BB'!$A$1:$C$6133,3,FALSE)","v":"Y"}]
[null,null,null,null,26445,2360.4308567939793,{"$f":"VLOOKUP(E1047,'[1]Combined AA and BB'!$A$1:$C$6133,3,FALSE)","v":"Y"}]
[null,null,null,null,26449,2360.4308567939793,{"$f":"VLOOKUP(E1048,'[1]Combined AA and BB'!$A$1:$C$6133,3,FALSE)","v":"Y"}]
[null,null,null,null,26450,2360.4308567939793,{"$f":"VLOOKUP(E1049,'[1]Combined AA and BB'!$A$1:$C$6133,3,FALSE)","v":"Y"}]
[null,null,null,null,26455,1248.9885183021138,{"$f":"VLOOKUP(E1050,'[1]Combined AA and BB'!$A$1:$C$6133,3,FALSE)","v":"Y"}]
[null,null,null,null,26460,1248.9885183021138,{"$f":"VLOOKUP(E1051,'[1]Combined AA and BB'!$A$1:$C$6133,3,FALSE)","v":"Y"}]
[null,null,null,null,26471,2360.4308567939793,{"$f":"VLOOKUP(E1052,'[1]Combined AA and BB'!$A$1:$C$6133,3,FALSE)","v":"Y"}]
[null,null,null,null,26474,1248.9885183021138,{"$f":"VLOOKUP(E1053,'[1]Combined AA and BB'!$A$1:$C$6133,3,FALSE)","v":"Y"}]
[null,null,null,null,26476,2360.4308567939793,{"$f":"VLOOKUP(E1054,'[1]Combined AA and BB'!$A$1:$C$6133,3,FALSE)","v":"Y"}]
[null,null,null,null,26477,2360.4308567939793,{"$f":"VLOOKUP(E1055,'[1]Combined AA and BB'!$A$1:$C$6133,3,FALSE)","v":"Y"}]
[null,null,null,null,26478,2360.4308567939793,{"$f":"VLOOKUP(E1056,'[1]Combined AA and BB'!$A$1:$C$6133,3,FALSE)","v":"Y"}]
[null,null,null,null,26479,2360.4308567939793,{"$f":"VLOOKUP(E1057,'[1]Combined AA and BB'!$A$1:$C$6133,3,FALSE)","v":"Y"}]
[null,null,null,null,26480,2360.4308567939793,{"$f":"VLOOKUP(E1058,'[1]Combined AA and BB'!$A$1:$C$6133,3,FALSE)","v":"Y"}]
[null,null,null,null,26483,2360.4308567939793,{"$f":"VLOOKUP(E1059,'[1]Combined AA and BB'!$A$1:$C$6133,3,FALSE)","v":"Y"}]
[null,null,null,null,26485,2360.4308567939793,{"$f":"VLOOKUP(E1060,'[1]Combined AA and BB'!$A$1:$C$6133,3,FALSE)","v":"Y"}]
[null,null,null,null,26489,2360.4308567939793,{"$f":"VLOOKUP(E1061,'[1]Combined AA and BB'!$A$1:$C$6133,3,FALSE)","v":"Y"}]
[null,null,null,null,26490,2360.4308567939793,{"$f":"VLOOKUP(E1062,'[1]Combined AA and BB'!$A$1:$C$6133,3,FALSE)","v":"Y"}]
[null,null,null,null,26492,2360.4308567939793,{"$f":"VLOOKUP(E1063,'[1]Combined AA and BB'!$A$1:$C$6133,3,FALSE)","v":"Y"}]
[null,null,null,null,26494,2360.4308567939793,{"$f":"VLOOKUP(E1064,'[1]Combined AA and BB'!$A$1:$C$6133,3,FALSE)","v":"Y"}]
[null,null,null,null,26496,2360.4308567939793,{"$f":"VLOOKUP(E1065,'[1]Combined AA and BB'!$A$1:$C$6133,3,FALSE)","v":"Y"}]
[null,null,null,null,26497,2360.4308567939793,{"$f":"VLOOKUP(E1066,'[1]Combined AA and BB'!$A$1:$C$6133,3,FALSE)","v":"Y"}]
[null,null,null,null,26498,2360.4308567939793,{"$f":"VLOOKUP(E1067,'[1]Combined AA and BB'!$A$1:$C$6133,3,FALSE)","v":"Y"}]
[null,null,null,null,26499,2360.4308567939793,{"$f":"VLOOKUP(E1068,'[1]Combined AA and BB'!$A$1:$C$6133,3,FALSE)","v":"Y"}]
[null,null,null,null,26500,5235.154665531295,{"$f":"VLOOKUP(E1069,'[1]Combined AA and BB'!$A$1:$C$6133,3,FALSE)","v":"Y"}]
[null,null,null,null,26502,2360.4308567939793,{"$f":"VLOOKUP(E1070,'[1]Combined AA and BB'!$A$1:$C$6133,3,FALSE)","v":"Y"}]
[null,null,null,null,26508,2360.4308567939793,{"$f":"VLOOKUP(E1071,'[1]Combined AA and BB'!$A$1:$C$6133,3,FALSE)","v":"Y"}]
[null,null,null,null,26510,2360.4308567939793,{"$f":"VLOOKUP(E1072,'[1]Combined AA and BB'!$A$1:$C$6133,3,FALSE)","v":"Y"}]
[null,null,null,null,26516,2360.4308567939793,{"$f":"VLOOKUP(E1073,'[1]Combined AA and BB'!$A$1:$C$6133,3,FALSE)","v":"Y"}]
[null,null,null,null,26517,2360.4308567939793,{"$f":"VLOOKUP(E1074,'[1]Combined AA and BB'!$A$1:$C$6133,3,FALSE)","v":"Y"}]
[null,null,null,null,26518,8854.0515688595315,{"$f":"VLOOKUP(E1075,'[1]Combined AA and BB'!$A$1:$C$6133,3,FALSE)","v":"Y"}]
[null,null,null,null,26520,2360.4308567939793,{"$f":"VLOOKUP(E1076,'[1]Combined AA and BB'!$A$1:$C$6133,3,FALSE)","v":"Y"}]
[null,null,null,null,26525,1248.9885183021138,{"$f":"VLOOKUP(E1077,'[1]Combined AA and BB'!$A$1:$C$6133,3,FALSE)","v":"Y"}]
[null,null,null,null,26530,9416.4838625357934,{"$f":"VLOOKUP(E1078,'[1]Combined AA and BB'!$A$1:$C$6133,3,FALSE)","v":"Y"}]
[null,null,null,null,26531,9778.5613186566152,{"$f":"VLOOKUP(E1079,'[1]Combined AA and BB'!$A$1:$C$6133,3,FALSE)","v":"Y"}]
[null,null,null,null,26535,2360.4308567939793,{"$f":"VLOOKUP(E1080,'[1]Combined AA and BB'!$A$1:$C$6133,3,FALSE)","v":"Y"}]
[null,null,null,null,26536,9293.4617579852202,{"$f":"VLOOKUP(E1081,'[1]Combined AA and BB'!$A$1:$C$6133,3,FALSE)","v":"Y"}]
[null,null,null,null,26540,2360.4308567939793,{"$f":"VLOOKUP(E1082,'[1]Combined AA and BB'!$A$1:$C$6133,3,FALSE)","v":"Y"}]
[null,null,null,null,26541,4002.9990496249602,{"$f":"VLOOKUP(E1083,'[1]Combined AA and BB'!$A$1:$C$6133,3,FALSE)","v":"Y"}]
[null,null,null,null,26542,2360.4308567939793,{"$f":"VLOOKUP(E1084,'[1]Combined AA and BB'!$A$1:$C$6133,3,FALSE)","v":"Y"}]
[null,null,null,null,26545,4477.5811764876289,{"$f":"VLOOKUP(E1085,'[1]Combined AA and BB'!$A$1:$C$6133,3,FALSE)","v":"Y"}]
[null,null,null,null,26546,5235.154665531295,{"$f":"VLOOKUP(E1086,'[1]Combined AA and BB'!$A$1:$C$6133,3,FALSE)","v":"Y"}]
[null,null,null,null,26548,2360.4308567939793,{"$f":"VLOOKUP(E1087,'[1]Combined AA and BB'!$A$1:$C$6133,3,FALSE)","v":"Y"}]
[null,null,null,null,26550,2360.4308567939793,{"$f":"VLOOKUP(E1088,'[1]Combined AA and BB'!$A$1:$C$6133,3,FALSE)","v":"Y"}]
[null,null,null,null,26555,5235.154665531295,{"$f":"VLOOKUP(E1089,'[1]Combined AA and BB'!$A$1:$C$6133,3,FALSE)","v":"Y"}]
[null,null,null,null,26560,1248.9885183021138,{"$f":"VLOOKUP(E1090,'[1]Combined AA and BB'!$A$1:$C$6133,3,FALSE)","v":"Y"}]
[null,null,null,null,26561,2360.4308567939793,{"$f":"VLOOKUP(E1091,'[1]Combined AA and BB'!$A$1:$C$6133,3,FALSE)","v":"Y"}]
[null,null,null,null,26562,2360.4308567939793,{"$f":"VLOOKUP(E1092,'[1]Combined AA and BB'!$A$1:$C$6133,3,FALSE)","v":"Y"}]
[null,null,null,null,26565,2360.4308567939793,{"$f":"VLOOKUP(E1093,'[1]Combined AA and BB'!$A$1:$C$6133,3,FALSE)","v":"Y"}]
[null,null,null,null,26567,2360.4308567939793,{"$f":"VLOOKUP(E1094,'[1]Combined AA and BB'!$A$1:$C$6133,3,FALSE)","v":"Y"}]
[null,null,null,null,26568,10812.126840446579,{"$f":"VLOOKUP(E1095,'[1]Combined AA and BB'!$A$1:$C$6133,3,FALSE)","v":"Y"}]
[null,null,null,null,26580,"Not covered","NA"]
[null,null,null,null,26587,"Not covered","NA"]
[null,null,null,null,26590,"Not covered","NA"]
[null,null,null,null,26591,2360.4308567939793,{"$f":"VLOOKUP(E1099,'[1]Combined AA and BB'!$A$1:$C$6133,3,FALSE)","v":"Y"}]
[null,null,null,null,26593,2360.4308567939793,{"$f":"VLOOKUP(E1100,'[1]Combined AA and BB'!$A$1:$C$6133,3,FALSE)","v":"Y"}]
[null,null,null,null,26596,2360.4308567939793,{"$f":"VLOOKUP(E1101,'[1]Combined AA and BB'!$A$1:$C$6133,3,FALSE)","v":"Y"}]
[null,null,null,null,26600,179.82216601985061,{"$f":"VLOOKUP(E1102,'[1]Combined AA and BB'!$A$1:$C$6133,3,FALSE)","v":"Y"}]
[null,null,null,null,26605,179.82216601985061,{"$f":"VLOOKUP(E1103,'[1]Combined AA and BB'!$A$1:$C$6133,3,FALSE)","v":"Y"}]
[null,null,null,null,26607,2360.4308567939793,{"$f":"VLOOKUP(E1104,'[1]Combined AA and BB'!$A$1:$C$6133,3,FALSE)","v":"Y"}]
[null,null,null,null,26608,2360.4308567939793,{"$f":"VLOOKUP(E1105,'[1]Combined AA and BB'!$A$1:$C$6133,3,FALSE)","v":"Y"}]
[null,null,null,null,26615,2360.4308567939793,{"$f":"VLOOKUP(E1106,'[1]Combined AA and BB'!$A$1:$C$6133,3,FALSE)","v":"Y"}]
[null,null,null,null,26641,179.82216601985061,{"$f":"VLOOKUP(E1107,'[1]Combined AA and BB'!$A$1:$C$6133,3,FALSE)","v":"Y"}]
[null,null,null,null,26645,1248.9885183021138,{"$f":"VLOOKUP(E1108,'[1]Combined AA and BB'!$A$1:$C$6133,3,FALSE)","v":"Y"}]
[null,null,null,null,26650,2360.4308567939793,{"$f":"VLOOKUP(E1109,'[1]Combined AA and BB'!$A$1:$C$6133,3,FALSE)","v":"Y"}]
[null,null,null,null,26665,2360.4308567939793,{"$f":"VLOOKUP(E1110,'[1]Combined AA and BB'!$A$1:$C$6133,3,FALSE)","v":"Y"}]
[null,null,null,null,26670,179.82216601985061,{"$f":"VLOOKUP(E1111,'[1]Combined AA and BB'!$A$1:$C$6133,3,FALSE)","v":"Y"}]
[null,null,null,null,26675,1248.9885183021138,{"$f":"VLOOKUP(E1112,'[1]Combined AA and BB'!$A$1:$C$6133,3,FALSE)","v":"Y"}]
[null,null,null,null,26676,2360.4308567939793,{"$f":"VLOOKUP(E1113,'[1]Combined AA and BB'!$A$1:$C$6133,3,FALSE)","v":"Y"}]
[null,null,null,null,26685,2360.4308567939793,{"$f":"VLOOKUP(E1114,'[1]Combined AA and BB'!$A$1:$C$6133,3,FALSE)","v":"Y"}]
[null,null,null,null,26686,2360.4308567939793,{"$f":"VLOOKUP(E1115,'[1]Combined AA and BB'!$A$1:$C$6133,3,FALSE)","v":"Y"}]
[null,null,null,null,26700,179.82216601985061,{"$f":"VLOOKUP(E1116,'[1]Combined AA and BB'!$A$1:$C$6133,3,FALSE)","v":"Y"}]
[null,null,null,null,26705,1248.9885183021138,{"$f":"VLOOKUP(E1117,'[1]Combined AA and BB'!$A$1:$C$6133,3,FALSE)","v":"Y"}]
[null,null,null,null,26706,2360.4308567939793,{"$f":"VLOOKUP(E1118,'[1]Combined AA and BB'!$A$1:$C$6133,3,FALSE)","v":"Y"}]
[null,null,null,null,26715,2360.4308567939793,{"$f":"VLOOKUP(E1119,'[1]Combined AA and BB'!$A$1:$C$6133,3,FALSE)","v":"Y"}]
[null,null,null,null,26720,179.82216601985061,{"$f":"VLOOKUP(E1120,'[1]Combined AA and BB'!$A$1:$C$6133,3,FALSE)","v":"Y"}]
[null,null,null,null,26725,179.82216601985061,{"$f":"VLOOKUP(E1121,'[1]Combined AA and BB'!$A$1:$C$6133,3,FALSE)","v":"Y"}]
[null,null,null,null,26727,2360.4308567939793,{"$f":"VLOOKUP(E1122,'[1]Combined AA and BB'!$A$1:$C$6133,3,FALSE)","v":"Y"}]
[null,null,null,null,26735,2360.4308567939793,{"$f":"VLOOKUP(E1123,'[1]Combined AA and BB'!$A$1:$C$6133,3,FALSE)","v":"Y"}]
[null,null,null,null,26740,179.82216601985061,{"$f":"VLOOKUP(E1124,'[1]Combined AA and BB'!$A$1:$C$6133,3,FALSE)","v":"Y"}]
[null,null,null,null,26742,1248.9885183021138,{"$f":"VLOOKUP(E1125,'[1]Combined AA and BB'!$A$1:$C$6133,3,FALSE)","v":"Y"}]
[null,null,null,null,26746,2360.4308567939793,{"$f":"VLOOKUP(E1126,'[1]Combined AA and BB'!$A$1:$C$6133,3,FALSE)","v":"Y"}]
[null,null,null,null,26750,179.82216601985061,{"$f":"VLOOKUP(E1127,'[1]Combined AA and BB'!$A$1:$C$6133,3,FALSE)","v":"Y"}]
[null,null,null,null,26755,179.82216601985061,{"$f":"VLOOKUP(E1128,'[1]Combined AA and BB'!$A$1:$C$6133,3,FALSE)","v":"Y"}]
[null,null,null,null,26756,2360.4308567939793,{"$f":"VLOOKUP(E1129,'[1]Combined AA and BB'!$A$1:$C$6133,3,FALSE)","v":"Y"}]
[null,null,null,null,26765,2360.4308567939793,{"$f":"VLOOKUP(E1130,'[1]Combined AA and BB'!$A$1:$C$6133,3,FALSE)","v":"Y"}]
[null,null,null,null,26770,179.82216601985061,{"$f":"VLOOKUP(E1131,'[1]Combined AA and BB'!$A$1:$C$6133,3,FALSE)","v":"Y"}]
[null,null,null,null,26775,208.40408917035751,{"$f":"VLOOKUP(E1132,'[1]Combined AA and BB'!$A$1:$C$6133,3,FALSE)","v":"Y"}]
[null,null,null,null,26776,2360.4308567939793,{"$f":"VLOOKUP(E1133,'[1]Combined AA and BB'!$A$1:$C$6133,3,FALSE)","v":"Y"}]
[null,null,null,null,26785,2360.4308567939793,{"$f":"VLOOKUP(E1134,'[1]Combined AA and BB'!$A$1:$C$6133,3,FALSE)","v":"Y"}]
[null,null,null,null,26820,9760.1671919954624,{"$f":"VLOOKUP(E1135,'[1]Combined AA and BB'!$A$1:$C$6133,3,FALSE)","v":"Y"}]
[null,null,null,null,26841,5235.154665531295,{"$f":"VLOOKUP(E1136,'[1]Combined AA and BB'!$A$1:$C$6133,3,FALSE)","v":"Y"}]
[null,null,null,null,26842,5235.154665531295,{"$f":"VLOOKUP(E1137,'[1]Combined AA and BB'!$A$1:$C$6133,3,FALSE)","v":"Y"}]
[null,null,null,null,26843,8981.5014675135644,{"$f":"VLOOKUP(E1138,'[1]Combined AA and BB'!$A$1:$C$6133,3,FALSE)","v":"Y"}]
[null,null,null,null,26844,8854.0515688595315,{"$f":"VLOOKUP(E1139,'[1]Combined AA and BB'!$A$1:$C$6133,3,FALSE)","v":"Y"}]
[null,null,null,null,26850,5235.154665531295,{"$f":"VLOOKUP(E1140,'[1]Combined AA and BB'!$A$1:$C$6133,3,FALSE)","v":"Y"}]
[null,null,null,null,26852,5235.154665531295,{"$f":"VLOOKUP(E1141,'[1]Combined AA and BB'!$A$1:$C$6133,3,FALSE)","v":"Y"}]
[null,null,null,null,26860,2360.4308567939793,{"$f":"VLOOKUP(E1142,'[1]Combined AA and BB'!$A$1:$C$6133,3,FALSE)","v":"Y"}]
[null,null,null,null,26861,"Bundled","NA"]
[null,null,null,null,26862,2360.4308567939793,{"$f":"VLOOKUP(E1144,'[1]Combined AA and BB'!$A$1:$C$6133,3,FALSE)","v":"Y"}]
[null,null,null,null,26863,"Bundled","NA"]
[null,null,null,null,26910,2360.4308567939793,{"$f":"VLOOKUP(E1146,'[1]Combined AA and BB'!$A$1:$C$6133,3,FALSE)","v":"Y"}]
[null,null,null,null,26951,2360.4308567939793,{"$f":"VLOOKUP(E1147,'[1]Combined AA and BB'!$A$1:$C$6133,3,FALSE)","v":"Y"}]
[null,null,null,null,26952,2360.4308567939793,{"$f":"VLOOKUP(E1148,'[1]Combined AA and BB'!$A$1:$C$6133,3,FALSE)","v":"Y"}]
[null,null,null,null,26990,2360.4308567939793,{"$f":"VLOOKUP(E1149,'[1]Combined AA and BB'!$A$1:$C$6133,3,FALSE)","v":"Y"}]
[null,null,null,null,26991,1248.9885183021138,{"$f":"VLOOKUP(E1150,'[1]Combined AA and BB'!$A$1:$C$6133,3,FALSE)","v":"Y"}]
[null,null,null,null,27000,1248.9885183021138,{"$f":"VLOOKUP(E1151,'[1]Combined AA and BB'!$A$1:$C$6133,3,FALSE)","v":"Y"}]
[null,null,null,null,27001,2360.4308567939793,{"$f":"VLOOKUP(E1152,'[1]Combined AA and BB'!$A$1:$C$6133,3,FALSE)","v":"Y"}]
[null,null,null,null,27003,5235.154665531295,{"$f":"VLOOKUP(E1153,'[1]Combined AA and BB'!$A$1:$C$6133,3,FALSE)","v":"Y"}]
[null,null,null,null,27033,5235.154665531295,{"$f":"VLOOKUP(E1154,'[1]Combined AA and BB'!$A$1:$C$6133,3,FALSE)","v":"Y"}]
[null,null,null,null,27035,2360.4308567939793,{"$f":"VLOOKUP(E1155,'[1]Combined AA and BB'!$A$1:$C$6133,3,FALSE)","v":"Y"}]
[null,null,null,null,27040,1062.8859418079082,{"$f":"VLOOKUP(E1156,'[1]Combined AA and BB'!$A$1:$C$6133,3,FALSE)","v":"Y"}]
[null,null,null,null,27041,1062.8859418079082,{"$f":"VLOOKUP(E1157,'[1]Combined AA and BB'!$A$1:$C$6133,3,FALSE)","v":"Y"}]
[null,null,null,null,27043,1789.2422303467429,{"$f":"VLOOKUP(E1158,'[1]Combined AA and BB'!$A$1:$C$6133,3,FALSE)","v":"Y"}]
[null,null,null,null,27045,1789.2422303467429,{"$f":"VLOOKUP(E1159,'[1]Combined AA and BB'!$A$1:$C$6133,3,FALSE)","v":"Y"}]
[null,null,null,null,27047,1789.2422303467429,{"$f":"VLOOKUP(E1160,'[1]Combined AA and BB'!$A$1:$C$6133,3,FALSE)","v":"Y"}]
[null,null,null,null,27048,1789.2422303467429,{"$f":"VLOOKUP(E1161,'[1]Combined AA and BB'!$A$1:$C$6133,3,FALSE)","v":"Y"}]
[null,null,null,null,27049,"Not covered","NA"]
[null,null,null,null,27050,1248.9885183021138,{"$f":"VLOOKUP(E1163,'[1]Combined AA and BB'!$A$1:$C$6133,3,FALSE)","v":"Y"}]
[null,null,null,null,27052,1248.9885183021138,{"$f":"VLOOKUP(E1164,'[1]Combined AA and BB'!$A$1:$C$6133,3,FALSE)","v":"Y"}]
[null,null,null,null,27060,5235.154665531295,{"$f":"VLOOKUP(E1165,'[1]Combined AA and BB'!$A$1:$C$6133,3,FALSE)","v":"Y"}]
[null,null,null,null,27062,2360.4308567939793,{"$f":"VLOOKUP(E1166,'[1]Combined AA and BB'!$A$1:$C$6133,3,FALSE)","v":"Y"}]
[null,null,null,null,27065,5235.154665531295,{"$f":"VLOOKUP(E1167,'[1]Combined AA and BB'!$A$1:$C$6133,3,FALSE)","v":"Y"}]
[null,null,null,null,27066,2360.4308567939793,{"$f":"VLOOKUP(E1168,'[1]Combined AA and BB'!$A$1:$C$6133,3,FALSE)","v":"Y"}]
[null,null,null,null,27067,5235.154665531295,{"$f":"VLOOKUP(E1169,'[1]Combined AA and BB'!$A$1:$C$6133,3,FALSE)","v":"Y"}]
[null,null,null,null,27080,2360.4308567939793,{"$f":"VLOOKUP(E1170,'[1]Combined AA and BB'!$A$1:$C$6133,3,FALSE)","v":"Y"}]
[null,null,null,null,27086,1789.2422303467429,{"$f":"VLOOKUP(E1171,'[1]Combined AA and BB'!$A$1:$C$6133,3,FALSE)","v":"Y"}]
[null,null,null,null,27087,2360.4308567939793,{"$f":"VLOOKUP(E1172,'[1]Combined AA and BB'!$A$1:$C$6133,3,FALSE)","v":"Y"}]
[null,null,null,null,27093,"Bundled","NA"]
[null,null,null,null,27095,"Bundled","NA"]
[null,null,null,null,27097,2360.4308567939793,{"$f":"VLOOKUP(E1175,'[1]Combined AA and BB'!$A$1:$C$6133,3,FALSE)","v":"Y"}]
[null,null,null,null,27098,2360.4308567939793,{"$f":"VLOOKUP(E1176,'[1]Combined AA and BB'!$A$1:$C$6133,3,FALSE)","v":"Y"}]
[null,null,null,null,27100,5235.154665531295,{"$f":"VLOOKUP(E1177,'[1]Combined AA and BB'!$A$1:$C$6133,3,FALSE)","v":"Y"}]
[null,null,null,null,27105,2360.4308567939793,{"$f":"VLOOKUP(E1178,'[1]Combined AA and BB'!$A$1:$C$6133,3,FALSE)","v":"Y"}]
[null,null,null,null,27110,9986.5538164779209,{"$f":"VLOOKUP(E1179,'[1]Combined AA and BB'!$A$1:$C$6133,3,FALSE)","v":"Y"}]
[null,null,null,null,27111,2360.4308567939793,{"$f":"VLOOKUP(E1180,'[1]Combined AA and BB'!$A$1:$C$6133,3,FALSE)","v":"Y"}]
[null,null,null,null,27130,20872.382371114451,{"$f":"VLOOKUP(E1181,'[1]Combined AA and BB'!$A$1:$C$6133,3,FALSE)","v":"Y"}]
[null,null,null,null,27197,179.82216601985061,{"$f":"VLOOKUP(E1182,'[1]Combined AA and BB'!$A$1:$C$6133,3,FALSE)","v":"Y"}]
[null,null,null,null,27198,179.82216601985061,{"$f":"VLOOKUP(E1183,'[1]Combined AA and BB'!$A$1:$C$6133,3,FALSE)","v":"Y"}]
[null,null,null,null,27200,179.82216601985061,{"$f":"VLOOKUP(E1184,'[1]Combined AA and BB'!$A$1:$C$6133,3,FALSE)","v":"Y"}]
[null,null,null,null,27202,2360.4308567939793,{"$f":"VLOOKUP(E1185,'[1]Combined AA and BB'!$A$1:$C$6133,3,FALSE)","v":"Y"}]
[null,null,null,null,27220,179.82216601985061,{"$f":"VLOOKUP(E1186,'[1]Combined AA and BB'!$A$1:$C$6133,3,FALSE)","v":"Y"}]
[null,null,null,null,27230,179.82216601985061,{"$f":"VLOOKUP(E1187,'[1]Combined AA and BB'!$A$1:$C$6133,3,FALSE)","v":"Y"}]
[null,null,null,null,27238,1248.9885183021138,{"$f":"VLOOKUP(E1188,'[1]Combined AA and BB'!$A$1:$C$6133,3,FALSE)","v":"Y"}]
[null,null,null,null,27246,179.82216601985061,{"$f":"VLOOKUP(E1189,'[1]Combined AA and BB'!$A$1:$C$6133,3,FALSE)","v":"Y"}]
[null,null,null,null,27250,179.82216601985061,{"$f":"VLOOKUP(E1190,'[1]Combined AA and BB'!$A$1:$C$6133,3,FALSE)","v":"Y"}]
[null,null,null,null,27252,1248.9885183021138,{"$f":"VLOOKUP(E1191,'[1]Combined AA and BB'!$A$1:$C$6133,3,FALSE)","v":"Y"}]
[null,null,null,null,27256,179.82216601985061,{"$f":"VLOOKUP(E1192,'[1]Combined AA and BB'!$A$1:$C$6133,3,FALSE)","v":"Y"}]
[null,null,null,null,27257,1248.9885183021138,{"$f":"VLOOKUP(E1193,'[1]Combined AA and BB'!$A$1:$C$6133,3,FALSE)","v":"Y"}]
[null,null,null,null,27265,179.82216601985061,{"$f":"VLOOKUP(E1194,'[1]Combined AA and BB'!$A$1:$C$6133,3,FALSE)","v":"Y"}]
[null,null,null,null,27266,1248.9885183021138,{"$f":"VLOOKUP(E1195,'[1]Combined AA and BB'!$A$1:$C$6133,3,FALSE)","v":"Y"}]
[null,null,null,null,27267,2360.4308567939793,{"$f":"VLOOKUP(E1196,'[1]Combined AA and BB'!$A$1:$C$6133,3,FALSE)","v":"Y"}]
[null,null,null,null,27275,1248.9885183021138,{"$f":"VLOOKUP(E1197,'[1]Combined AA and BB'!$A$1:$C$6133,3,FALSE)","v":"Y"}]
[null,null,null,null,27279,37556.447142993653,{"$f":"VLOOKUP(E1198,'[1]Combined AA and BB'!$A$1:$C$6133,3,FALSE)","v":"Y"}]
[null,null,null,null,27301,1789.2422303467429,{"$f":"VLOOKUP(E1199,'[1]Combined AA and BB'!$A$1:$C$6133,3,FALSE)","v":"Y"}]
[null,null,null,null,27305,2360.4308567939793,{"$f":"VLOOKUP(E1200,'[1]Combined AA and BB'!$A$1:$C$6133,3,FALSE)","v":"Y"}]
[null,null,null,null,27306,2360.4308567939793,{"$f":"VLOOKUP(E1201,'[1]Combined AA and BB'!$A$1:$C$6133,3,FALSE)","v":"Y"}]
[null,null,null,null,27307,2360.4308567939793,{"$f":"VLOOKUP(E1202,'[1]Combined AA and BB'!$A$1:$C$6133,3,FALSE)","v":"Y"}]
[null,null,null,null,27310,2360.4308567939793,{"$f":"VLOOKUP(E1203,'[1]Combined AA and BB'!$A$1:$C$6133,3,FALSE)","v":"Y"}]
[null,null,null,null,27323,1062.8859418079082,{"$f":"VLOOKUP(E1204,'[1]Combined AA and BB'!$A$1:$C$6133,3,FALSE)","v":"Y"}]
[null,null,null,null,27324,1789.2422303467429,{"$f":"VLOOKUP(E1205,'[1]Combined AA and BB'!$A$1:$C$6133,3,FALSE)","v":"Y"}]
[null,null,null,null,27325,1424.7621552558512,{"$f":"VLOOKUP(E1206,'[1]Combined AA and BB'!$A$1:$C$6133,3,FALSE)","v":"Y"}]
[null,null,null,null,27326,1424.7621552558512,{"$f":"VLOOKUP(E1207,'[1]Combined AA and BB'!$A$1:$C$6133,3,FALSE)","v":"Y"}]
[null,null,null,null,27327,1062.8859418079082,{"$f":"VLOOKUP(E1208,'[1]Combined AA and BB'!$A$1:$C$6133,3,FALSE)","v":"Y"}]
[null,null,null,null,27328,1789.2422303467429,{"$f":"VLOOKUP(E1209,'[1]Combined AA and BB'!$A$1:$C$6133,3,FALSE)","v":"Y"}]
[null,null,null,null,27329,1789.2422303467429,{"$f":"VLOOKUP(E1210,'[1]Combined AA and BB'!$A$1:$C$6133,3,FALSE)","v":"Y"}]
[null,null,null,null,27330,2360.4308567939793,{"$f":"VLOOKUP(E1211,'[1]Combined AA and BB'!$A$1:$C$6133,3,FALSE)","v":"Y"}]
[null,null,null,null,27331,2360.4308567939793,{"$f":"VLOOKUP(E1212,'[1]Combined AA and BB'!$A$1:$C$6133,3,FALSE)","v":"Y"}]
[null,null,null,null,27332,2360.4308567939793,{"$f":"VLOOKUP(E1213,'[1]Combined AA and BB'!$A$1:$C$6133,3,FALSE)","v":"Y"}]
[null,null,null,null,27333,2360.4308567939793,{"$f":"VLOOKUP(E1214,'[1]Combined AA and BB'!$A$1:$C$6133,3,FALSE)","v":"Y"}]
[null,null,null,null,27334,2360.4308567939793,{"$f":"VLOOKUP(E1215,'[1]Combined AA and BB'!$A$1:$C$6133,3,FALSE)","v":"Y"}]
[null,null,null,null,27335,5235.154665531295,{"$f":"VLOOKUP(E1216,'[1]Combined AA and BB'!$A$1:$C$6133,3,FALSE)","v":"Y"}]
[null,null,null,null,27337,1789.2422303467429,{"$f":"VLOOKUP(E1217,'[1]Combined AA and BB'!$A$1:$C$6133,3,FALSE)","v":"Y"}]
[null,null,null,null,27339,1789.2422303467429,{"$f":"VLOOKUP(E1218,'[1]Combined AA and BB'!$A$1:$C$6133,3,FALSE)","v":"Y"}]
[null,null,null,null,27340,2360.4308567939793,{"$f":"VLOOKUP(E1219,'[1]Combined AA and BB'!$A$1:$C$6133,3,FALSE)","v":"Y"}]
[null,null,null,null,27345,2360.4308567939793,{"$f":"VLOOKUP(E1220,'[1]Combined AA and BB'!$A$1:$C$6133,3,FALSE)","v":"Y"}]
[null,null,null,null,27347,2360.4308567939793,{"$f":"VLOOKUP(E1221,'[1]Combined AA and BB'!$A$1:$C$6133,3,FALSE)","v":"Y"}]
[null,null,null,null,27350,5235.154665531295,{"$f":"VLOOKUP(E1222,'[1]Combined AA and BB'!$A$1:$C$6133,3,FALSE)","v":"Y"}]
[null,null,null,null,27355,2360.4308567939793,{"$f":"VLOOKUP(E1223,'[1]Combined AA and BB'!$A$1:$C$6133,3,FALSE)","v":"Y"}]
[null,null,null,null,27356,10734.562359657788,{"$f":"VLOOKUP(E1224,'[1]Combined AA and BB'!$A$1:$C$6133,3,FALSE)","v":"Y"}]
[null,null,null,null,27357,8854.0515688595315,{"$f":"VLOOKUP(E1225,'[1]Combined AA and BB'!$A$1:$C$6133,3,FALSE)","v":"Y"}]
[null,null,null,null,27358,"Bundled","NA"]
[null,null,null,null,27360,2360.4308567939793,{"$f":"VLOOKUP(E1227,'[1]Combined AA and BB'!$A$1:$C$6133,3,FALSE)","v":"Y"}]
[null,null,null,null,27369,"Bundled","NA"]
[null,null,null,null,27372,1789.2422303467429,{"$f":"VLOOKUP(E1229,'[1]Combined AA and BB'!$A$1:$C$6133,3,FALSE)","v":"Y"}]
[null,null,null,null,27380,5235.154665531295,{"$f":"VLOOKUP(E1230,'[1]Combined AA and BB'!$A$1:$C$6133,3,FALSE)","v":"Y"}]
[null,null,null,null,27381,8826.1530512565078,{"$f":"VLOOKUP(E1231,'[1]Combined AA and BB'!$A$1:$C$6133,3,FALSE)","v":"Y"}]
[null,null,null,null,27385,5235.154665531295,{"$f":"VLOOKUP(E1232,'[1]Combined AA and BB'!$A$1:$C$6133,3,FALSE)","v":"Y"}]
[null,null,null,null,27386,5235.154665531295,{"$f":"VLOOKUP(E1233,'[1]Combined AA and BB'!$A$1:$C$6133,3,FALSE)","v":"Y"}]
[null,null,null,null,27390,2360.4308567939793,{"$f":"VLOOKUP(E1234,'[1]Combined AA and BB'!$A$1:$C$6133,3,FALSE)","v":"Y"}]
[null,null,null,null,27391,2360.4308567939793,{"$f":"VLOOKUP(E1235,'[1]Combined AA and BB'!$A$1:$C$6133,3,FALSE)","v":"Y"}]
[null,null,null,null,27392,2360.4308567939793,{"$f":"VLOOKUP(E1236,'[1]Combined AA and BB'!$A$1:$C$6133,3,FALSE)","v":"Y"}]
[null,null,null,null,27393,5235.154665531295,{"$f":"VLOOKUP(E1237,'[1]Combined AA and BB'!$A$1:$C$6133,3,FALSE)","v":"Y"}]
[null,null,null,null,27394,5235.154665531295,{"$f":"VLOOKUP(E1238,'[1]Combined AA and BB'!$A$1:$C$6133,3,FALSE)","v":"Y"}]
[null,null,null,null,27395,2360.4308567939793,{"$f":"VLOOKUP(E1239,'[1]Combined AA and BB'!$A$1:$C$6133,3,FALSE)","v":"Y"}]
[null,null,null,null,27396,9543.3077234631182,{"$f":"VLOOKUP(E1240,'[1]Combined AA and BB'!$A$1:$C$6133,3,FALSE)","v":"Y"}]
[null,null,null,null,27397,5235.154665531295,{"$f":"VLOOKUP(E1241,'[1]Combined AA and BB'!$A$1:$C$6133,3,FALSE)","v":"Y"}]
[null,null,null,null,27400,5235.154665531295,{"$f":"VLOOKUP(E1242,'[1]Combined AA and BB'!$A$1:$C$6133,3,FALSE)","v":"Y"}]
[null,null,null,null,27403,10473.531490329446,{"$f":"VLOOKUP(E1243,'[1]Combined AA and BB'!$A$1:$C$6133,3,FALSE)","v":"Y"}]
[null,null,null,null,27405,5235.154665531295,{"$f":"VLOOKUP(E1244,'[1]Combined AA and BB'!$A$1:$C$6133,3,FALSE)","v":"Y"}]
[null,null,null,null,27407,5235.154665531295,{"$f":"VLOOKUP(E1245,'[1]Combined AA and BB'!$A$1:$C$6133,3,FALSE)","v":"Y"}]
[null,null,null,null,27409,5235.154665531295,{"$f":"VLOOKUP(E1246,'[1]Combined AA and BB'!$A$1:$C$6133,3,FALSE)","v":"Y"}]
[null,null,null,null,27415,21774.730385385999,{"$f":"VLOOKUP(E1247,'[1]Combined AA and BB'!$A$1:$C$6133,3,FALSE)","v":"Y"}]
[null,null,null,null,27416,5235.154665531295,{"$f":"VLOOKUP(E1248,'[1]Combined AA and BB'!$A$1:$C$6133,3,FALSE)","v":"Y"}]
[null,null,null,null,27418,9171.7258764004273,{"$f":"VLOOKUP(E1249,'[1]Combined AA and BB'!$A$1:$C$6133,3,FALSE)","v":"Y"}]
[null,null,null,null,27420,5235.154665531295,{"$f":"VLOOKUP(E1250,'[1]Combined AA and BB'!$A$1:$C$6133,3,FALSE)","v":"Y"}]
[null,null,null,null,27422,5235.154665531295,{"$f":"VLOOKUP(E1251,'[1]Combined AA and BB'!$A$1:$C$6133,3,FALSE)","v":"Y"}]
[null,null,null,null,27424,5235.154665531295,{"$f":"VLOOKUP(E1252,'[1]Combined AA and BB'!$A$1:$C$6133,3,FALSE)","v":"Y"}]
[null,null,null,null,27425,2360.4308567939793,{"$f":"VLOOKUP(E1253,'[1]Combined AA and BB'!$A$1:$C$6133,3,FALSE)","v":"Y"}]
[null,null,null,null,27427,9609.8953725768188,{"$f":"VLOOKUP(E1254,'[1]Combined AA and BB'!$A$1:$C$6133,3,FALSE)","v":"Y"}]
[null,null,null,null,27428,19593.011672809895,{"$f":"VLOOKUP(E1255,'[1]Combined AA and BB'!$A$1:$C$6133,3,FALSE)","v":"Y"}]
[null,null,null,null,27429,19027.426425491838,{"$f":"VLOOKUP(E1256,'[1]Combined AA and BB'!$A$1:$C$6133,3,FALSE)","v":"Y"}]
[null,null,null,null,27430,8854.0515688595315,{"$f":"VLOOKUP(E1257,'[1]Combined AA and BB'!$A$1:$C$6133,3,FALSE)","v":"Y"}]
[null,null,null,null,27435,2360.4308567939793,{"$f":"VLOOKUP(E1258,'[1]Combined AA and BB'!$A$1:$C$6133,3,FALSE)","v":"Y"}]
[null,null,null,null,27437,5235.154665531295,{"$f":"VLOOKUP(E1259,'[1]Combined AA and BB'!$A$1:$C$6133,3,FALSE)","v":"Y"}]
[null,null,null,null,27438,18767.393118824748,{"$f":"VLOOKUP(E1260,'[1]Combined AA and BB'!$A$1:$C$6133,3,FALSE)","v":"Y"}]
[null,null,null,null,27440,21094.728206633597,{"$f":"VLOOKUP(E1261,'[1]Combined AA and BB'!$A$1:$C$6133,3,FALSE)","v":"Y"}]
[null,null,null,null,27441,10734.562359657788,{"$f":"VLOOKUP(E1262,'[1]Combined AA and BB'!$A$1:$C$6133,3,FALSE)","v":"Y"}]
[null,null,null,null,27442,19840.046159769656,{"$f":"VLOOKUP(E1263,'[1]Combined AA and BB'!$A$1:$C$6133,3,FALSE)","v":"Y"}]
[null,null,null,null,27443,20401.738590677993,{"$f":"VLOOKUP(E1264,'[1]Combined AA and BB'!$A$1:$C$6133,3,FALSE)","v":"Y"}]
[null,null,null,null,27446,20192.414339874413,{"$f":"VLOOKUP(E1265,'[1]Combined AA and BB'!$A$1:$C$6133,3,FALSE)","v":"Y"}]
[null,null,null,null,27447,20464.137478274799,{"$f":"VLOOKUP(E1266,'[1]Combined AA and BB'!$A$1:$C$6133,3,FALSE)","v":"Y"}]
[null,null,null,null,27496,2360.4308567939793,{"$f":"VLOOKUP(E1267,'[1]Combined AA and BB'!$A$1:$C$6133,3,FALSE)","v":"Y"}]
[null,null,null,null,27497,2360.4308567939793,{"$f":"VLOOKUP(E1268,'[1]Combined AA and BB'!$A$1:$C$6133,3,FALSE)","v":"Y"}]
[null,null,null,null,27498,1248.9885183021138,{"$f":"VLOOKUP(E1269,'[1]Combined AA and BB'!$A$1:$C$6133,3,FALSE)","v":"Y"}]
[null,null,null,null,27499,5235.154665531295,{"$f":"VLOOKUP(E1270,'[1]Combined AA and BB'!$A$1:$C$6133,3,FALSE)","v":"Y"}]
[null,null,null,null,27500,179.82216601985061,{"$f":"VLOOKUP(E1271,'[1]Combined AA and BB'!$A$1:$C$6133,3,FALSE)","v":"Y"}]
[null,null,null,null,27501,179.82216601985061,{"$f":"VLOOKUP(E1272,'[1]Combined AA and BB'!$A$1:$C$6133,3,FALSE)","v":"Y"}]
[null,null,null,null,27502,1248.9885183021138,{"$f":"VLOOKUP(E1273,'[1]Combined AA and BB'!$A$1:$C$6133,3,FALSE)","v":"Y"}]
[null,null,null,null,27503,1248.9885183021138,{"$f":"VLOOKUP(E1274,'[1]Combined AA and BB'!$A$1:$C$6133,3,FALSE)","v":"Y"}]
[null,null,null,null,27508,179.82216601985061,{"$f":"VLOOKUP(E1275,'[1]Combined AA and BB'!$A$1:$C$6133,3,FALSE)","v":"Y"}]
[null,null,null,null,27509,9676.4716391863949,{"$f":"VLOOKUP(E1276,'[1]Combined AA and BB'!$A$1:$C$6133,3,FALSE)","v":"Y"}]
[null,null,null,null,27510,1248.9885183021138,{"$f":"VLOOKUP(E1277,'[1]Combined AA and BB'!$A$1:$C$6133,3,FALSE)","v":"Y"}]
[null,null,null,null,27516,179.82216601985061,{"$f":"VLOOKUP(E1278,'[1]Combined AA and BB'!$A$1:$C$6133,3,FALSE)","v":"Y"}]
[null,null,null,null,27517,1248.9885183021138,{"$f":"VLOOKUP(E1279,'[1]Combined AA and BB'!$A$1:$C$6133,3,FALSE)","v":"Y"}]
[null,null,null,null,27520,179.82216601985061,{"$f":"VLOOKUP(E1280,'[1]Combined AA and BB'!$A$1:$C$6133,3,FALSE)","v":"Y"}]
[null,null,null,null,27524,5235.154665531295,{"$f":"VLOOKUP(E1281,'[1]Combined AA and BB'!$A$1:$C$6133,3,FALSE)","v":"Y"}]
[null,null,null,null,27530,179.82216601985061,{"$f":"VLOOKUP(E1282,'[1]Combined AA and BB'!$A$1:$C$6133,3,FALSE)","v":"Y"}]
[null,null,null,null,27532,2360.4308567939793,{"$f":"VLOOKUP(E1283,'[1]Combined AA and BB'!$A$1:$C$6133,3,FALSE)","v":"Y"}]
[null,null,null,null,27538,179.82216601985061,{"$f":"VLOOKUP(E1284,'[1]Combined AA and BB'!$A$1:$C$6133,3,FALSE)","v":"Y"}]
[null,null,null,null,27550,179.82216601985061,{"$f":"VLOOKUP(E1285,'[1]Combined AA and BB'!$A$1:$C$6133,3,FALSE)","v":"Y"}]
[null,null,null,null,27552,1248.9885183021138,{"$f":"VLOOKUP(E1286,'[1]Combined AA and BB'!$A$1:$C$6133,3,FALSE)","v":"Y"}]
[null,null,null,null,27560,179.82216601985061,{"$f":"VLOOKUP(E1287,'[1]Combined AA and BB'!$A$1:$C$6133,3,FALSE)","v":"Y"}]
[null,null,null,null,27562,179.82216601985061,{"$f":"VLOOKUP(E1288,'[1]Combined AA and BB'!$A$1:$C$6133,3,FALSE)","v":"Y"}]
[null,null,null,null,27566,5235.154665531295,{"$f":"VLOOKUP(E1289,'[1]Combined AA and BB'!$A$1:$C$6133,3,FALSE)","v":"Y"}]
[null,null,null,null,27570,1248.9885183021138,{"$f":"VLOOKUP(E1290,'[1]Combined AA and BB'!$A$1:$C$6133,3,FALSE)","v":"Y"}]
[null,null,null,null,27594,2360.4308567939793,{"$f":"VLOOKUP(E1291,'[1]Combined AA and BB'!$A$1:$C$6133,3,FALSE)","v":"Y"}]
[null,null,null,null,27600,2360.4308567939793,{"$f":"VLOOKUP(E1292,'[1]Combined AA and BB'!$A$1:$C$6133,3,FALSE)","v":"Y"}]
[null,null,null,null,27601,2360.4308567939793,{"$f":"VLOOKUP(E1293,'[1]Combined AA and BB'!$A$1:$C$6133,3,FALSE)","v":"Y"}]
[null,null,null,null,27602,2360.4308567939793,{"$f":"VLOOKUP(E1294,'[1]Combined AA and BB'!$A$1:$C$6133,3,FALSE)","v":"Y"}]
[null,null,null,null,27603,1789.2422303467429,{"$f":"VLOOKUP(E1295,'[1]Combined AA and BB'!$A$1:$C$6133,3,FALSE)","v":"Y"}]
[null,null,null,null,27604,2360.4308567939793,{"$f":"VLOOKUP(E1296,'[1]Combined AA and BB'!$A$1:$C$6133,3,FALSE)","v":"Y"}]
[null,null,null,null,27605,1248.9885183021138,{"$f":"VLOOKUP(E1297,'[1]Combined AA and BB'!$A$1:$C$6133,3,FALSE)","v":"Y"}]
[null,null,null,null,27606,2360.4308567939793,{"$f":"VLOOKUP(E1298,'[1]Combined AA and BB'!$A$1:$C$6133,3,FALSE)","v":"Y"}]
[null,null,null,null,27607,2360.4308567939793,{"$f":"VLOOKUP(E1299,'[1]Combined AA and BB'!$A$1:$C$6133,3,FALSE)","v":"Y"}]
[null,null,null,null,27610,2360.4308567939793,{"$f":"VLOOKUP(E1300,'[1]Combined AA and BB'!$A$1:$C$6133,3,FALSE)","v":"Y"}]
[null,null,null,null,27612,2360.4308567939793,{"$f":"VLOOKUP(E1301,'[1]Combined AA and BB'!$A$1:$C$6133,3,FALSE)","v":"Y"}]
[null,null,null,null,27613,471.55680000000001,{"$f":"VLOOKUP(E1302,'[1]Combined AA and BB'!$A$1:$C$6133,3,FALSE)","v":"Y"}]
[null,null,null,null,27614,1789.2422303467429,{"$f":"VLOOKUP(E1303,'[1]Combined AA and BB'!$A$1:$C$6133,3,FALSE)","v":"Y"}]
[null,null,null,null,27615,"Not covered","NA"]
[null,null,null,null,27618,1062.8859418079082,{"$f":"VLOOKUP(E1305,'[1]Combined AA and BB'!$A$1:$C$6133,3,FALSE)","v":"Y"}]
[null,null,null,null,27619,1789.2422303467429,{"$f":"VLOOKUP(E1306,'[1]Combined AA and BB'!$A$1:$C$6133,3,FALSE)","v":"Y"}]
[null,null,null,null,27620,2360.4308567939793,{"$f":"VLOOKUP(E1307,'[1]Combined AA and BB'!$A$1:$C$6133,3,FALSE)","v":"Y"}]
[null,null,null,null,27625,2360.4308567939793,{"$f":"VLOOKUP(E1308,'[1]Combined AA and BB'!$A$1:$C$6133,3,FALSE)","v":"Y"}]
[null,null,null,null,27626,2360.4308567939793,{"$f":"VLOOKUP(E1309,'[1]Combined AA and BB'!$A$1:$C$6133,3,FALSE)","v":"Y"}]
[null,null,null,null,27630,2360.4308567939793,{"$f":"VLOOKUP(E1310,'[1]Combined AA and BB'!$A$1:$C$6133,3,FALSE)","v":"Y"}]
[null,null,null,null,27632,1789.2422303467429,{"$f":"VLOOKUP(E1311,'[1]Combined AA and BB'!$A$1:$C$6133,3,FALSE)","v":"Y"}]
[null,null,null,null,27634,1789.2422303467429,{"$f":"VLOOKUP(E1312,'[1]Combined AA and BB'!$A$1:$C$6133,3,FALSE)","v":"Y"}]
[null,null,null,null,27635,2360.4308567939793,{"$f":"VLOOKUP(E1313,'[1]Combined AA and BB'!$A$1:$C$6133,3,FALSE)","v":"Y"}]
[null,null,null,null,27637,9527.4632777252937,{"$f":"VLOOKUP(E1314,'[1]Combined AA and BB'!$A$1:$C$6133,3,FALSE)","v":"Y"}]
[null,null,null,null,27638,5235.154665531295,{"$f":"VLOOKUP(E1315,'[1]Combined AA and BB'!$A$1:$C$6133,3,FALSE)","v":"Y"}]
[null,null,null,null,27640,2360.4308567939793,{"$f":"VLOOKUP(E1316,'[1]Combined AA and BB'!$A$1:$C$6133,3,FALSE)","v":"Y"}]
[null,null,null,null,27641,2360.4308567939793,{"$f":"VLOOKUP(E1317,'[1]Combined AA and BB'!$A$1:$C$6133,3,FALSE)","v":"Y"}]
[null,null,null,null,27647,3992.1287581884499,{"$f":"VLOOKUP(E1318,'[1]Combined AA and BB'!$A$1:$C$6133,3,FALSE)","v":"Y"}]
[null,null,null,null,27648,"Bundled","NA"]
[null,null,null,null,27650,5235.154665531295,{"$f":"VLOOKUP(E1320,'[1]Combined AA and BB'!$A$1:$C$6133,3,FALSE)","v":"Y"}]
[null,null,null,null,27652,9131.7732869322081,{"$f":"VLOOKUP(E1321,'[1]Combined AA and BB'!$A$1:$C$6133,3,FALSE)","v":"Y"}]
[null,null,null,null,27654,9115.9516062026287,{"$f":"VLOOKUP(E1322,'[1]Combined AA and BB'!$A$1:$C$6133,3,FALSE)","v":"Y"}]
[null,null,null,null,27656,4500.4486272687263,{"$f":"VLOOKUP(E1323,'[1]Combined AA and BB'!$A$1:$C$6133,3,FALSE)","v":"Y"}]
[null,null,null,null,27658,2360.4308567939793,{"$f":"VLOOKUP(E1324,'[1]Combined AA and BB'!$A$1:$C$6133,3,FALSE)","v":"Y"}]
[null,null,null,null,27659,5235.154665531295,{"$f":"VLOOKUP(E1325,'[1]Combined AA and BB'!$A$1:$C$6133,3,FALSE)","v":"Y"}]
[null,null,null,null,27664,5235.154665531295,{"$f":"VLOOKUP(E1326,'[1]Combined AA and BB'!$A$1:$C$6133,3,FALSE)","v":"Y"}]
[null,null,null,null,27665,5235.154665531295,{"$f":"VLOOKUP(E1327,'[1]Combined AA and BB'!$A$1:$C$6133,3,FALSE)","v":"Y"}]
[null,null,null,null,27675,2360.4308567939793,{"$f":"VLOOKUP(E1328,'[1]Combined AA and BB'!$A$1:$C$6133,3,FALSE)","v":"Y"}]
[null,null,null,null,27676,5235.154665531295,{"$f":"VLOOKUP(E1329,'[1]Combined AA and BB'!$A$1:$C$6133,3,FALSE)","v":"Y"}]
[null,null,null,null,27680,2360.4308567939793,{"$f":"VLOOKUP(E1330,'[1]Combined AA and BB'!$A$1:$C$6133,3,FALSE)","v":"Y"}]
[null,null,null,null,27681,2360.4308567939793,{"$f":"VLOOKUP(E1331,'[1]Combined AA and BB'!$A$1:$C$6133,3,FALSE)","v":"Y"}]
[null,null,null,null,27685,2360.4308567939793,{"$f":"VLOOKUP(E1332,'[1]Combined AA and BB'!$A$1:$C$6133,3,FALSE)","v":"Y"}]
[null,null,null,null,27686,2360.4308567939793,{"$f":"VLOOKUP(E1333,'[1]Combined AA and BB'!$A$1:$C$6133,3,FALSE)","v":"Y"}]
[null,null,null,null,27687,2360.4308567939793,{"$f":"VLOOKUP(E1334,'[1]Combined AA and BB'!$A$1:$C$6133,3,FALSE)","v":"Y"}]
[null,null,null,null,27690,5235.154665531295,{"$f":"VLOOKUP(E1335,'[1]Combined AA and BB'!$A$1:$C$6133,3,FALSE)","v":"Y"}]
[null,null,null,null,27691,5235.154665531295,{"$f":"VLOOKUP(E1336,'[1]Combined AA and BB'!$A$1:$C$6133,3,FALSE)","v":"Y"}]
[null,null,null,null,27692,"Bundled","NA"]
[null,null,null,null,27695,9013.2131239974551,{"$f":"VLOOKUP(E1338,'[1]Combined AA and BB'!$A$1:$C$6133,3,FALSE)","v":"Y"}]
[null,null,null,null,27696,9300.4506155161253,{"$f":"VLOOKUP(E1339,'[1]Combined AA and BB'!$A$1:$C$6133,3,FALSE)","v":"Y"}]
[null,null,null,null,27698,9467.8417211342585,{"$f":"VLOOKUP(E1340,'[1]Combined AA and BB'!$A$1:$C$6133,3,FALSE)","v":"Y"}]
[null,null,null,null,27700,9138.7507619589924,{"$f":"VLOOKUP(E1341,'[1]Combined AA and BB'!$A$1:$C$6133,3,FALSE)","v":"Y"}]
[null,null,null,null,27704,2360.4308567939793,{"$f":"VLOOKUP(E1342,'[1]Combined AA and BB'!$A$1:$C$6133,3,FALSE)","v":"N"}]
[null,null,null,null,27705,9278.892152709057,{"$f":"VLOOKUP(E1343,'[1]Combined AA and BB'!$A$1:$C$6133,3,FALSE)","v":"Y"}]
[null,null,null,null,27707,2360.4308567939793,{"$f":"VLOOKUP(E1344,'[1]Combined AA and BB'!$A$1:$C$6133,3,FALSE)","v":"Y"}]
[null,null,null,null,27709,21766.910605054189,{"$f":"VLOOKUP(E1345,'[1]Combined AA and BB'!$A$1:$C$6133,3,FALSE)","v":"Y"}]
[null,null,null,null,27726,9178.7033514272152,{"$f":"VLOOKUP(E1346,'[1]Combined AA and BB'!$A$1:$C$6133,3,FALSE)","v":"Y"}]
[null,null,null,null,27730,2360.4308567939793,{"$f":"VLOOKUP(E1347,'[1]Combined AA and BB'!$A$1:$C$6133,3,FALSE)","v":"Y"}]
[null,null,null,null,27732,2360.4308567939793,{"$f":"VLOOKUP(E1348,'[1]Combined AA and BB'!$A$1:$C$6133,3,FALSE)","v":"Y"}]
[null,null,null,null,27734,2360.4308567939793,{"$f":"VLOOKUP(E1349,'[1]Combined AA and BB'!$A$1:$C$6133,3,FALSE)","v":"Y"}]
[null,null,null,null,27740,2360.4308567939793,{"$f":"VLOOKUP(E1350,'[1]Combined AA and BB'!$A$1:$C$6133,3,FALSE)","v":"Y"}]
[null,null,null,null,27742,2360.4308567939793,{"$f":"VLOOKUP(E1351,'[1]Combined AA and BB'!$A$1:$C$6133,3,FALSE)","v":"Y"}]
[null,null,null,null,27745,9360.0607896030397,{"$f":"VLOOKUP(E1352,'[1]Combined AA and BB'!$A$1:$C$6133,3,FALSE)","v":"Y"}]
[null,null,null,null,27750,179.82216601985061,{"$f":"VLOOKUP(E1353,'[1]Combined AA and BB'!$A$1:$C$6133,3,FALSE)","v":"Y"}]
[null,null,null,null,27752,1248.9885183021138,{"$f":"VLOOKUP(E1354,'[1]Combined AA and BB'!$A$1:$C$6133,3,FALSE)","v":"Y"}]
[null,null,null,null,27756,9850.2141821046043,{"$f":"VLOOKUP(E1355,'[1]Combined AA and BB'!$A$1:$C$6133,3,FALSE)","v":"Y"}]
[null,null,null,null,27758,20379.633767673069,{"$f":"VLOOKUP(E1356,'[1]Combined AA and BB'!$A$1:$C$6133,3,FALSE)","v":"Y"}]
[null,null,null,null,27759,19457.798906344655,{"$f":"VLOOKUP(E1357,'[1]Combined AA and BB'!$A$1:$C$6133,3,FALSE)","v":"Y"}]
[null,null,null,null,27760,179.82216601985061,{"$f":"VLOOKUP(E1358,'[1]Combined AA and BB'!$A$1:$C$6133,3,FALSE)","v":"Y"}]
[null,null,null,null,27762,1248.9885183021138,{"$f":"VLOOKUP(E1359,'[1]Combined AA and BB'!$A$1:$C$6133,3,FALSE)","v":"Y"}]
[null,null,null,null,27766,5235.154665531295,{"$f":"VLOOKUP(E1360,'[1]Combined AA and BB'!$A$1:$C$6133,3,FALSE)","v":"Y"}]
[null,null,null,null,27767,179.82216601985061,{"$f":"VLOOKUP(E1361,'[1]Combined AA and BB'!$A$1:$C$6133,3,FALSE)","v":"Y"}]
[null,null,null,null,27768,2316.6013864218062,{"$f":"VLOOKUP(E1362,'[1]Combined AA and BB'!$A$1:$C$6133,3,FALSE)","v":"Y"}]
[null,null,null,null,27769,5235.154665531295,{"$f":"VLOOKUP(E1363,'[1]Combined AA and BB'!$A$1:$C$6133,3,FALSE)","v":"Y"}]
[null,null,null,null,27780,179.82216601985061,{"$f":"VLOOKUP(E1364,'[1]Combined AA and BB'!$A$1:$C$6133,3,FALSE)","v":"Y"}]
[null,null,null,null,27781,1248.9885183021138,{"$f":"VLOOKUP(E1365,'[1]Combined AA and BB'!$A$1:$C$6133,3,FALSE)","v":"Y"}]
[null,null,null,null,27784,5235.154665531295,{"$f":"VLOOKUP(E1366,'[1]Combined AA and BB'!$A$1:$C$6133,3,FALSE)","v":"Y"}]
[null,null,null,null,27786,179.82216601985061,{"$f":"VLOOKUP(E1367,'[1]Combined AA and BB'!$A$1:$C$6133,3,FALSE)","v":"Y"}]
[null,null,null,null,27788,179.82216601985061,{"$f":"VLOOKUP(E1368,'[1]Combined AA and BB'!$A$1:$C$6133,3,FALSE)","v":"Y"}]
[null,null,null,null,27792,9141.9378631131567,{"$f":"VLOOKUP(E1369,'[1]Combined AA and BB'!$A$1:$C$6133,3,FALSE)","v":"Y"}]
[null,null,null,null,27808,179.82216601985061,{"$f":"VLOOKUP(E1370,'[1]Combined AA and BB'!$A$1:$C$6133,3,FALSE)","v":"Y"}]
[null,null,null,null,27810,1248.9885183021138,{"$f":"VLOOKUP(E1371,'[1]Combined AA and BB'!$A$1:$C$6133,3,FALSE)","v":"Y"}]
[null,null,null,null,27814,9237.0500675565872,{"$f":"VLOOKUP(E1372,'[1]Combined AA and BB'!$A$1:$C$6133,3,FALSE)","v":"Y"}]
[null,null,null,null,27816,179.82216601985061,{"$f":"VLOOKUP(E1373,'[1]Combined AA and BB'!$A$1:$C$6133,3,FALSE)","v":"Y"}]
[null,null,null,null,27818,1248.9885183021138,{"$f":"VLOOKUP(E1374,'[1]Combined AA and BB'!$A$1:$C$6133,3,FALSE)","v":"Y"}]
[null,null,null,null,27822,9136.235228548032,{"$f":"VLOOKUP(E1375,'[1]Combined AA and BB'!$A$1:$C$6133,3,FALSE)","v":"Y"}]
[null,null,null,null,27823,9214.8541845186865,{"$f":"VLOOKUP(E1376,'[1]Combined AA and BB'!$A$1:$C$6133,3,FALSE)","v":"Y"}]
[null,null,null,null,27824,179.82216601985061,{"$f":"VLOOKUP(E1377,'[1]Combined AA and BB'!$A$1:$C$6133,3,FALSE)","v":"Y"}]
[null,null,null,null,27825,1248.9885183021138,{"$f":"VLOOKUP(E1378,'[1]Combined AA and BB'!$A$1:$C$6133,3,FALSE)","v":"Y"}]
[null,null,null,null,27826,9868.6083087657553,{"$f":"VLOOKUP(E1379,'[1]Combined AA and BB'!$A$1:$C$6133,3,FALSE)","v":"Y"}]
[null,null,null,null,27827,19187.36199091006,{"$f":"VLOOKUP(E1380,'[1]Combined AA and BB'!$A$1:$C$6133,3,FALSE)","v":"Y"}]
[null,null,null,null,27828,19989.578116420376,{"$f":"VLOOKUP(E1381,'[1]Combined AA and BB'!$A$1:$C$6133,3,FALSE)","v":"Y"}]
[null,null,null,null,27829,9536.9676686671628,{"$f":"VLOOKUP(E1382,'[1]Combined AA and BB'!$A$1:$C$6133,3,FALSE)","v":"Y"}]
[null,null,null,null,27830,179.82216601985061,{"$f":"VLOOKUP(E1383,'[1]Combined AA and BB'!$A$1:$C$6133,3,FALSE)","v":"Y"}]
[null,null,null,null,27831,2360.4308567939793,{"$f":"VLOOKUP(E1384,'[1]Combined AA and BB'!$A$1:$C$6133,3,FALSE)","v":"Y"}]
[null,null,null,null,27832,9381.6192524101098,{"$f":"VLOOKUP(E1385,'[1]Combined AA and BB'!$A$1:$C$6133,3,FALSE)","v":"Y"}]
[null,null,null,null,27840,179.82216601985061,{"$f":"VLOOKUP(E1386,'[1]Combined AA and BB'!$A$1:$C$6133,3,FALSE)","v":"Y"}]
[null,null,null,null,27842,1248.9885183021138,{"$f":"VLOOKUP(E1387,'[1]Combined AA and BB'!$A$1:$C$6133,3,FALSE)","v":"Y"}]
[null,null,null,null,27846,10235.739596716743,{"$f":"VLOOKUP(E1388,'[1]Combined AA and BB'!$A$1:$C$6133,3,FALSE)","v":"Y"}]
[null,null,null,null,27848,5235.154665531295,{"$f":"VLOOKUP(E1389,'[1]Combined AA and BB'!$A$1:$C$6133,3,FALSE)","v":"Y"}]
[null,null,null,null,27860,2360.4308567939793,{"$f":"VLOOKUP(E1390,'[1]Combined AA and BB'!$A$1:$C$6133,3,FALSE)","v":"Y"}]
[null,null,null,null,27870,20643.571273254005,{"$f":"VLOOKUP(E1391,'[1]Combined AA and BB'!$A$1:$C$6133,3,FALSE)","v":"Y"}]
[null,null,null,null,27871,19413.589260334811,{"$f":"VLOOKUP(E1392,'[1]Combined AA and BB'!$A$1:$C$6133,3,FALSE)","v":"Y"}]
[null,null,null,null,27884,2360.4308567939793,{"$f":"VLOOKUP(E1393,'[1]Combined AA and BB'!$A$1:$C$6133,3,FALSE)","v":"Y"}]
[null,null,null,null,27889,5235.154665531295,{"$f":"VLOOKUP(E1394,'[1]Combined AA and BB'!$A$1:$C$6133,3,FALSE)","v":"Y"}]
[null,null,null,null,27892,2360.4308567939793,{"$f":"VLOOKUP(E1395,'[1]Combined AA and BB'!$A$1:$C$6133,3,FALSE)","v":"Y"}]
[null,null,null,null,27893,5235.154665531295,{"$f":"VLOOKUP(E1396,'[1]Combined AA and BB'!$A$1:$C$6133,3,FALSE)","v":"Y"}]
[null,null,null,null,27894,2360.4308567939793,{"$f":"VLOOKUP(E1397,'[1]Combined AA and BB'!$A$1:$C$6133,3,FALSE)","v":"Y"}]
[null,null,null,null,27899,"UR/BR","N"]
[null,null,null,null,28001,317.34820000000002,{"$f":"VLOOKUP(E1399,'[1]Combined AA and BB'!$A$1:$C$6133,3,FALSE)","v":"Y"}]
[null,null,null,null,28002,1248.9885183021138,{"$f":"VLOOKUP(E1400,'[1]Combined AA and BB'!$A$1:$C$6133,3,FALSE)","v":"Y"}]
[null,null,null,null,28003,2360.4308567939793,{"$f":"VLOOKUP(E1401,'[1]Combined AA and BB'!$A$1:$C$6133,3,FALSE)","v":"Y"}]
[null,null,null,null,28005,2360.4308567939793,{"$f":"VLOOKUP(E1402,'[1]Combined AA and BB'!$A$1:$C$6133,3,FALSE)","v":"Y"}]
[null,null,null,null,28008,2360.4308567939793,{"$f":"VLOOKUP(E1403,'[1]Combined AA and BB'!$A$1:$C$6133,3,FALSE)","v":"Y"}]
[null,null,null,null,28010,431.06959999999998,{"$f":"VLOOKUP(E1404,'[1]Combined AA and BB'!$A$1:$C$6133,3,FALSE)","v":"Y"}]
[null,null,null,null,28011,1248.9885183021138,{"$f":"VLOOKUP(E1405,'[1]Combined AA and BB'!$A$1:$C$6133,3,FALSE)","v":"Y"}]
[null,null,null,null,28020,2360.4308567939793,{"$f":"VLOOKUP(E1406,'[1]Combined AA and BB'!$A$1:$C$6133,3,FALSE)","v":"Y"}]
[null,null,null,null,28022,2360.4308567939793,{"$f":"VLOOKUP(E1407,'[1]Combined AA and BB'!$A$1:$C$6133,3,FALSE)","v":"Y"}]
[null,null,null,null,28024,1248.9885183021138,{"$f":"VLOOKUP(E1408,'[1]Combined AA and BB'!$A$1:$C$6133,3,FALSE)","v":"Y"}]
[null,null,null,null,28035,1424.7621552558512,{"$f":"VLOOKUP(E1409,'[1]Combined AA and BB'!$A$1:$C$6133,3,FALSE)","v":"Y"}]
[null,null,null,null,28039,1789.2422303467429,{"$f":"VLOOKUP(E1410,'[1]Combined AA and BB'!$A$1:$C$6133,3,FALSE)","v":"Y"}]
[null,null,null,null,28041,1789.2422303467429,{"$f":"VLOOKUP(E1411,'[1]Combined AA and BB'!$A$1:$C$6133,3,FALSE)","v":"Y"}]
[null,null,null,null,28043,1062.8859418079082,{"$f":"VLOOKUP(E1412,'[1]Combined AA and BB'!$A$1:$C$6133,3,FALSE)","v":"Y"}]
[null,null,null,null,28045,1789.2422303467429,{"$f":"VLOOKUP(E1413,'[1]Combined AA and BB'!$A$1:$C$6133,3,FALSE)","v":"Y"}]
[null,null,null,null,28046,"Not covered","NA"]
[null,null,null,null,28050,2360.4308567939793,{"$f":"VLOOKUP(E1415,'[1]Combined AA and BB'!$A$1:$C$6133,3,FALSE)","v":"Y"}]
[null,null,null,null,28052,2360.4308567939793,{"$f":"VLOOKUP(E1416,'[1]Combined AA and BB'!$A$1:$C$6133,3,FALSE)","v":"Y"}]
[null,null,null,null,28054,2360.4308567939793,{"$f":"VLOOKUP(E1417,'[1]Combined AA and BB'!$A$1:$C$6133,3,FALSE)","v":"Y"}]
[null,null,null,null,28055,1424.7621552558512,{"$f":"VLOOKUP(E1418,'[1]Combined AA and BB'!$A$1:$C$6133,3,FALSE)","v":"Y"}]
[null,null,null,null,28060,2360.4308567939793,{"$f":"VLOOKUP(E1419,'[1]Combined AA and BB'!$A$1:$C$6133,3,FALSE)","v":"Y"}]
[null,null,null,null,28062,2360.4308567939793,{"$f":"VLOOKUP(E1420,'[1]Combined AA and BB'!$A$1:$C$6133,3,FALSE)","v":"Y"}]
[null,null,null,null,28070,5235.154665531295,{"$f":"VLOOKUP(E1421,'[1]Combined AA and BB'!$A$1:$C$6133,3,FALSE)","v":"Y"}]
[null,null,null,null,28072,2360.4308567939793,{"$f":"VLOOKUP(E1422,'[1]Combined AA and BB'!$A$1:$C$6133,3,FALSE)","v":"Y"}]
[null,null,null,null,28080,1248.9885183021138,{"$f":"VLOOKUP(E1423,'[1]Combined AA and BB'!$A$1:$C$6133,3,FALSE)","v":"Y"}]
[null,null,null,null,28086,2360.4308567939793,{"$f":"VLOOKUP(E1424,'[1]Combined AA and BB'!$A$1:$C$6133,3,FALSE)","v":"Y"}]
[null,null,null,null,28088,2360.4308567939793,{"$f":"VLOOKUP(E1425,'[1]Combined AA and BB'!$A$1:$C$6133,3,FALSE)","v":"Y"}]
[null,null,null,null,28090,1248.9885183021138,{"$f":"VLOOKUP(E1426,'[1]Combined AA and BB'!$A$1:$C$6133,3,FALSE)","v":"Y"}]
[null,null,null,null,28092,1248.9885183021138,{"$f":"VLOOKUP(E1427,'[1]Combined AA and BB'!$A$1:$C$6133,3,FALSE)","v":"Y"}]
[null,null,null,null,28100,2360.4308567939793,{"$f":"VLOOKUP(E1428,'[1]Combined AA and BB'!$A$1:$C$6133,3,FALSE)","v":"Y"}]
[null,null,null,null,28102,8975.1500302134882,{"$f":"VLOOKUP(E1429,'[1]Combined AA and BB'!$A$1:$C$6133,3,FALSE)","v":"Y"}]
[null,null,null,null,28103,8908.5737636039103,{"$f":"VLOOKUP(E1430,'[1]Combined AA and BB'!$A$1:$C$6133,3,FALSE)","v":"Y"}]
[null,null,null,null,28104,2360.4308567939793,{"$f":"VLOOKUP(E1431,'[1]Combined AA and BB'!$A$1:$C$6133,3,FALSE)","v":"Y"}]
[null,null,null,null,28106,5235.154665531295,{"$f":"VLOOKUP(E1432,'[1]Combined AA and BB'!$A$1:$C$6133,3,FALSE)","v":"Y"}]
[null,null,null,null,28107,5235.154665531295,{"$f":"VLOOKUP(E1433,'[1]Combined AA and BB'!$A$1:$C$6133,3,FALSE)","v":"Y"}]
[null,null,null,null,28108,1248.9885183021138,{"$f":"VLOOKUP(E1434,'[1]Combined AA and BB'!$A$1:$C$6133,3,FALSE)","v":"Y"}]
[null,null,null,null,28110,2360.4308567939793,{"$f":"VLOOKUP(E1435,'[1]Combined AA and BB'!$A$1:$C$6133,3,FALSE)","v":"Y"}]
[null,null,null,null,28111,2360.4308567939793,{"$f":"VLOOKUP(E1436,'[1]Combined AA and BB'!$A$1:$C$6133,3,FALSE)","v":"Y"}]
[null,null,null,null,28112,2360.4308567939793,{"$f":"VLOOKUP(E1437,'[1]Combined AA and BB'!$A$1:$C$6133,3,FALSE)","v":"Y"}]
[null,null,null,null,28113,2360.4308567939793,{"$f":"VLOOKUP(E1438,'[1]Combined AA and BB'!$A$1:$C$6133,3,FALSE)","v":"Y"}]
[null,null,null,null,28114,2360.4308567939793,{"$f":"VLOOKUP(E1439,'[1]Combined AA and BB'!$A$1:$C$6133,3,FALSE)","v":"Y"}]
[null,null,null,null,28116,2360.4308567939793,{"$f":"VLOOKUP(E1440,'[1]Combined AA and BB'!$A$1:$C$6133,3,FALSE)","v":"Y"}]
[null,null,null,null,28118,2360.4308567939793,{"$f":"VLOOKUP(E1441,'[1]Combined AA and BB'!$A$1:$C$6133,3,FALSE)","v":"Y"}]
[null,null,null,null,28119,2360.4308567939793,{"$f":"VLOOKUP(E1442,'[1]Combined AA and BB'!$A$1:$C$6133,3,FALSE)","v":"Y"}]
[null,null,null,null,28120,2360.4308567939793,{"$f":"VLOOKUP(E1443,'[1]Combined AA and BB'!$A$1:$C$6133,3,FALSE)","v":"Y"}]
[null,null,null,null,28122,2360.4308567939793,{"$f":"VLOOKUP(E1444,'[1]Combined AA and BB'!$A$1:$C$6133,3,FALSE)","v":"Y"}]
[null,null,null,null,28124,880.00119999999993,{"$f":"VLOOKUP(E1445,'[1]Combined AA and BB'!$A$1:$C$6133,3,FALSE)","v":"Y"}]
[null,null,null,null,28126,2360.4308567939793,{"$f":"VLOOKUP(E1446,'[1]Combined AA and BB'!$A$1:$C$6133,3,FALSE)","v":"Y"}]
[null,null,null,null,28130,9043.0011372847293,{"$f":"VLOOKUP(E1447,'[1]Combined AA and BB'!$A$1:$C$6133,3,FALSE)","v":"Y"}]
[null,null,null,null,28140,2360.4308567939793,{"$f":"VLOOKUP(E1448,'[1]Combined AA and BB'!$A$1:$C$6133,3,FALSE)","v":"Y"}]
[null,null,null,null,28150,2360.4308567939793,{"$f":"VLOOKUP(E1449,'[1]Combined AA and BB'!$A$1:$C$6133,3,FALSE)","v":"Y"}]
[null,null,null,null,28153,2360.4308567939793,{"$f":"VLOOKUP(E1450,'[1]Combined AA and BB'!$A$1:$C$6133,3,FALSE)","v":"Y"}]
[null,null,null,null,28160,2360.4308567939793,{"$f":"VLOOKUP(E1451,'[1]Combined AA and BB'!$A$1:$C$6133,3,FALSE)","v":"Y"}]
[null,null,null,null,28171,"Not covered","NA"]
[null,null,null,null,28173,"Not covered","NA"]
[null,null,null,null,28175,"Not covered","NA"]
[null,null,null,null,28190,450.12239999999997,{"$f":"VLOOKUP(E1455,'[1]Combined AA and BB'!$A$1:$C$6133,3,FALSE)","v":"Y"}]
[null,null,null,null,28192,1062.8859418079082,{"$f":"VLOOKUP(E1456,'[1]Combined AA and BB'!$A$1:$C$6133,3,FALSE)","v":"Y"}]
[null,null,null,null,28193,1062.8859418079082,{"$f":"VLOOKUP(E1457,'[1]Combined AA and BB'!$A$1:$C$6133,3,FALSE)","v":"Y"}]
[null,null,null,null,28200,2360.4308567939793,{"$f":"VLOOKUP(E1458,'[1]Combined AA and BB'!$A$1:$C$6133,3,FALSE)","v":"Y"}]
[null,null,null,null,28202,9004.9608085090058,{"$f":"VLOOKUP(E1459,'[1]Combined AA and BB'!$A$1:$C$6133,3,FALSE)","v":"Y"}]
[null,null,null,null,28208,2360.4308567939793,{"$f":"VLOOKUP(E1460,'[1]Combined AA and BB'!$A$1:$C$6133,3,FALSE)","v":"Y"}]
[null,null,null,null,28210,9112.1270848176355,{"$f":"VLOOKUP(E1461,'[1]Combined AA and BB'!$A$1:$C$6133,3,FALSE)","v":"Y"}]
[null,null,null,null,28220,832.96460000000002,{"$f":"VLOOKUP(E1462,'[1]Combined AA and BB'!$A$1:$C$6133,3,FALSE)","v":"Y"}]
[null,null,null,null,28222,2360.4308567939793,{"$f":"VLOOKUP(E1463,'[1]Combined AA and BB'!$A$1:$C$6133,3,FALSE)","v":"Y"}]
[null,null,null,null,28225,2360.4308567939793,{"$f":"VLOOKUP(E1464,'[1]Combined AA and BB'!$A$1:$C$6133,3,FALSE)","v":"Y"}]
[null,null,null,null,28226,2360.4308567939793,{"$f":"VLOOKUP(E1465,'[1]Combined AA and BB'!$A$1:$C$6133,3,FALSE)","v":"Y"}]
[null,null,null,null,28230,803.79,{"$f":"VLOOKUP(E1466,'[1]Combined AA and BB'!$A$1:$C$6133,3,FALSE)","v":"Y"}]
[null,null,null,null,28232,700.78579999999999,{"$f":"VLOOKUP(E1467,'[1]Combined AA and BB'!$A$1:$C$6133,3,FALSE)","v":"Y"}]
[null,null,null,null,28234,1248.9885183021138,{"$f":"VLOOKUP(E1468,'[1]Combined AA and BB'!$A$1:$C$6133,3,FALSE)","v":"Y"}]
[null,null,null,null,28238,5235.154665531295,{"$f":"VLOOKUP(E1469,'[1]Combined AA and BB'!$A$1:$C$6133,3,FALSE)","v":"Y"}]
[null,null,null,null,28240,2360.4308567939793,{"$f":"VLOOKUP(E1470,'[1]Combined AA and BB'!$A$1:$C$6133,3,FALSE)","v":"Y"}]
[null,null,null,null,28250,2360.4308567939793,{"$f":"VLOOKUP(E1471,'[1]Combined AA and BB'!$A$1:$C$6133,3,FALSE)","v":"Y"}]
[null,null,null,null,28260,2360.4308567939793,{"$f":"VLOOKUP(E1472,'[1]Combined AA and BB'!$A$1:$C$6133,3,FALSE)","v":"Y"}]
[null,null,null,null,28261,2112.376497464882,{"$f":"VLOOKUP(E1473,'[1]Combined AA and BB'!$A$1:$C$6133,3,FALSE)","v":"Y"}]
[null,null,null,null,28262,11039.765540382457,{"$f":"VLOOKUP(E1474,'[1]Combined AA and BB'!$A$1:$C$6133,3,FALSE)","v":"Y"}]
[null,null,null,null,28264,1248.9885183021138,{"$f":"VLOOKUP(E1475,'[1]Combined AA and BB'!$A$1:$C$6133,3,FALSE)","v":"Y"}]
[null,null,null,null,28270,2360.4308567939793,{"$f":"VLOOKUP(E1476,'[1]Combined AA and BB'!$A$1:$C$6133,3,FALSE)","v":"Y"}]
[null,null,null,null,28272,707.93060000000003,{"$f":"VLOOKUP(E1477,'[1]Combined AA and BB'!$A$1:$C$6133,3,FALSE)","v":"Y"}]
[null,null,null,null,28280,2360.4308567939793,{"$f":"VLOOKUP(E1478,'[1]Combined AA and BB'!$A$1:$C$6133,3,FALSE)","v":"Y"}]
[null,null,null,null,28285,2360.4308567939793,{"$f":"VLOOKUP(E1479,'[1]Combined AA and BB'!$A$1:$C$6133,3,FALSE)","v":"Y"}]
[null,null,null,null,28286,2360.4308567939793,{"$f":"VLOOKUP(E1480,'[1]Combined AA and BB'!$A$1:$C$6133,3,FALSE)","v":"Y"}]
[null,null,null,null,28288,2360.4308567939793,{"$f":"VLOOKUP(E1481,'[1]Combined AA and BB'!$A$1:$C$6133,3,FALSE)","v":"Y"}]
[null,null,null,null,28289,2360.4308567939793,{"$f":"VLOOKUP(E1482,'[1]Combined AA and BB'!$A$1:$C$6133,3,FALSE)","v":"Y"}]
[null,null,null,null,28291,9770.3090031681641,{"$f":"VLOOKUP(E1483,'[1]Combined AA and BB'!$A$1:$C$6133,3,FALSE)","v":"Y"}]
[null,null,null,null,28292,2360.4308567939793,{"$f":"VLOOKUP(E1484,'[1]Combined AA and BB'!$A$1:$C$6133,3,FALSE)","v":"Y"}]
[null,null,null,null,28295,2360.4308567939793,{"$f":"VLOOKUP(E1485,'[1]Combined AA and BB'!$A$1:$C$6133,3,FALSE)","v":"Y"}]
[null,null,null,null,28296,2360.4308567939793,{"$f":"VLOOKUP(E1486,'[1]Combined AA and BB'!$A$1:$C$6133,3,FALSE)","v":"Y"}]
[null,null,null,null,28297,10190.710410410111,{"$f":"VLOOKUP(E1487,'[1]Combined AA and BB'!$A$1:$C$6133,3,FALSE)","v":"Y"}]
[null,null,null,null,28298,9150.1674135933608,{"$f":"VLOOKUP(E1488,'[1]Combined AA and BB'!$A$1:$C$6133,3,FALSE)","v":"Y"}]
[null,null,null,null,28299,8965.6456392716191,{"$f":"VLOOKUP(E1489,'[1]Combined AA and BB'!$A$1:$C$6133,3,FALSE)","v":"Y"}]
[null,null,null,null,28300,9223.7325377338457,{"$f":"VLOOKUP(E1490,'[1]Combined AA and BB'!$A$1:$C$6133,3,FALSE)","v":"Y"}]
[null,null,null,null,28302,10362.574840148191,{"$f":"VLOOKUP(E1491,'[1]Combined AA and BB'!$A$1:$C$6133,3,FALSE)","v":"Y"}]
[null,null,null,null,28304,5235.154665531295,{"$f":"VLOOKUP(E1492,'[1]Combined AA and BB'!$A$1:$C$6133,3,FALSE)","v":"Y"}]
[null,null,null,null,28305,9738.6087291883941,{"$f":"VLOOKUP(E1493,'[1]Combined AA and BB'!$A$1:$C$6133,3,FALSE)","v":"Y"}]
[null,null,null,null,28306,5235.154665531295,{"$f":"VLOOKUP(E1494,'[1]Combined AA and BB'!$A$1:$C$6133,3,FALSE)","v":"Y"}]
[null,null,null,null,28307,5235.154665531295,{"$f":"VLOOKUP(E1495,'[1]Combined AA and BB'!$A$1:$C$6133,3,FALSE)","v":"Y"}]
[null,null,null,null,28308,2360.4308567939793,{"$f":"VLOOKUP(E1496,'[1]Combined AA and BB'!$A$1:$C$6133,3,FALSE)","v":"Y"}]
[null,null,null,null,28309,8854.0515688595315,{"$f":"VLOOKUP(E1497,'[1]Combined AA and BB'!$A$1:$C$6133,3,FALSE)","v":"Y"}]
[null,null,null,null,28310,8854.0515688595315,{"$f":"VLOOKUP(E1498,'[1]Combined AA and BB'!$A$1:$C$6133,3,FALSE)","v":"Y"}]
[null,null,null,null,28312,2360.4308567939793,{"$f":"VLOOKUP(E1499,'[1]Combined AA and BB'!$A$1:$C$6133,3,FALSE)","v":"Y"}]
[null,null,null,null,28313,2360.4308567939793,{"$f":"VLOOKUP(E1500,'[1]Combined AA and BB'!$A$1:$C$6133,3,FALSE)","v":"Y"}]
[null,null,null,null,28315,2360.4308567939793,{"$f":"VLOOKUP(E1501,'[1]Combined AA and BB'!$A$1:$C$6133,3,FALSE)","v":"Y"}]
[null,null,null,null,28320,18155.003014557024,{"$f":"VLOOKUP(E1502,'[1]Combined AA and BB'!$A$1:$C$6133,3,FALSE)","v":"Y"}]
[null,null,null,null,28322,9239.5769834716702,{"$f":"VLOOKUP(E1503,'[1]Combined AA and BB'!$A$1:$C$6133,3,FALSE)","v":"Y"}]
[null,null,null,null,28340,"Not covered","NA"]
[null,null,null,null,28341,"Not covered","NA"]
[null,null,null,null,28344,"Not covered","NA"]
[null,null,null,null,28345,"Not covered","NA"]
[null,null,null,null,28400,179.82216601985061,{"$f":"VLOOKUP(E1508,'[1]Combined AA and BB'!$A$1:$C$6133,3,FALSE)","v":"Y"}]
[null,null,null,null,28405,179.82216601985061,{"$f":"VLOOKUP(E1509,'[1]Combined AA and BB'!$A$1:$C$6133,3,FALSE)","v":"Y"}]
[null,null,null,null,28406,9242.1266643949984,{"$f":"VLOOKUP(E1510,'[1]Combined AA and BB'!$A$1:$C$6133,3,FALSE)","v":"Y"}]
[null,null,null,null,28415,9355.6329954995817,{"$f":"VLOOKUP(E1511,'[1]Combined AA and BB'!$A$1:$C$6133,3,FALSE)","v":"Y"}]
[null,null,null,null,28420,18155.003014557024,{"$f":"VLOOKUP(E1512,'[1]Combined AA and BB'!$A$1:$C$6133,3,FALSE)","v":"Y"}]
[null,null,null,null,28430,179.82216601985061,{"$f":"VLOOKUP(E1513,'[1]Combined AA and BB'!$A$1:$C$6133,3,FALSE)","v":"Y"}]
[null,null,null,null,28435,1248.9885183021138,{"$f":"VLOOKUP(E1514,'[1]Combined AA and BB'!$A$1:$C$6133,3,FALSE)","v":"Y"}]
[null,null,null,null,28436,9072.8119155802469,{"$f":"VLOOKUP(E1515,'[1]Combined AA and BB'!$A$1:$C$6133,3,FALSE)","v":"Y"}]
[null,null,null,null,28445,9692.3388499324647,{"$f":"VLOOKUP(E1516,'[1]Combined AA and BB'!$A$1:$C$6133,3,FALSE)","v":"Y"}]
[null,null,null,null,28446,"Not covered","NA"]
[null,null,null,null,28450,179.82216601985061,{"$f":"VLOOKUP(E1518,'[1]Combined AA and BB'!$A$1:$C$6133,3,FALSE)","v":"Y"}]
[null,null,null,null,28455,551.34039999999993,{"$f":"VLOOKUP(E1519,'[1]Combined AA and BB'!$A$1:$C$6133,3,FALSE)","v":"Y"}]
[null,null,null,null,28456,5235.154665531295,{"$f":"VLOOKUP(E1520,'[1]Combined AA and BB'!$A$1:$C$6133,3,FALSE)","v":"Y"}]
[null,null,null,null,28465,5235.154665531295,{"$f":"VLOOKUP(E1521,'[1]Combined AA and BB'!$A$1:$C$6133,3,FALSE)","v":"Y"}]
[null,null,null,null,28470,179.82216601985061,{"$f":"VLOOKUP(E1522,'[1]Combined AA and BB'!$A$1:$C$6133,3,FALSE)","v":"Y"}]
[null,null,null,null,28475,179.82216601985061,{"$f":"VLOOKUP(E1523,'[1]Combined AA and BB'!$A$1:$C$6133,3,FALSE)","v":"Y"}]
[null,null,null,null,28476,2360.4308567939793,{"$f":"VLOOKUP(E1524,'[1]Combined AA and BB'!$A$1:$C$6133,3,FALSE)","v":"Y"}]
[null,null,null,null,28485,9173.638137092923,{"$f":"VLOOKUP(E1525,'[1]Combined AA and BB'!$A$1:$C$6133,3,FALSE)","v":"Y"}]
[null,null,null,null,28490,269.12079999999997,{"$f":"VLOOKUP(E1526,'[1]Combined AA and BB'!$A$1:$C$6133,3,FALSE)","v":"Y"}]
[null,null,null,null,28495,179.82216601985061,{"$f":"VLOOKUP(E1527,'[1]Combined AA and BB'!$A$1:$C$6133,3,FALSE)","v":"Y"}]
[null,null,null,null,28496,2360.4308567939793,{"$f":"VLOOKUP(E1528,'[1]Combined AA and BB'!$A$1:$C$6133,3,FALSE)","v":"Y"}]
[null,null,null,null,28505,2360.4308567939793,{"$f":"VLOOKUP(E1529,'[1]Combined AA and BB'!$A$1:$C$6133,3,FALSE)","v":"Y"}]
[null,null,null,null,28510,228.6336,{"$f":"VLOOKUP(E1530,'[1]Combined AA and BB'!$A$1:$C$6133,3,FALSE)","v":"Y"}]
[null,null,null,null,28515,309.608,{"$f":"VLOOKUP(E1531,'[1]Combined AA and BB'!$A$1:$C$6133,3,FALSE)","v":"Y"}]
[null,null,null,null,28525,2360.4308567939793,{"$f":"VLOOKUP(E1532,'[1]Combined AA and BB'!$A$1:$C$6133,3,FALSE)","v":"Y"}]
[null,null,null,null,28530,218.51179999999999,{"$f":"VLOOKUP(E1533,'[1]Combined AA and BB'!$A$1:$C$6133,3,FALSE)","v":"Y"}]
[null,null,null,null,28531,5235.154665531295,{"$f":"VLOOKUP(E1534,'[1]Combined AA and BB'!$A$1:$C$6133,3,FALSE)","v":"Y"}]
[null,null,null,null,28540,179.82216601985061,{"$f":"VLOOKUP(E1535,'[1]Combined AA and BB'!$A$1:$C$6133,3,FALSE)","v":"Y"}]
[null,null,null,null,28545,2360.4308567939793,{"$f":"VLOOKUP(E1536,'[1]Combined AA and BB'!$A$1:$C$6133,3,FALSE)","v":"Y"}]
[null,null,null,null,28546,1248.9885183021138,{"$f":"VLOOKUP(E1537,'[1]Combined AA and BB'!$A$1:$C$6133,3,FALSE)","v":"Y"}]
[null,null,null,null,28555,9141.9378631131567,{"$f":"VLOOKUP(E1538,'[1]Combined AA and BB'!$A$1:$C$6133,3,FALSE)","v":"Y"}]
[null,null,null,null,28570,179.82216601985061,{"$f":"VLOOKUP(E1539,'[1]Combined AA and BB'!$A$1:$C$6133,3,FALSE)","v":"Y"}]
[null,null,null,null,28575,2360.4308567939793,{"$f":"VLOOKUP(E1540,'[1]Combined AA and BB'!$A$1:$C$6133,3,FALSE)","v":"Y"}]
[null,null,null,null,28576,5235.154665531295,{"$f":"VLOOKUP(E1541,'[1]Combined AA and BB'!$A$1:$C$6133,3,FALSE)","v":"Y"}]
[null,null,null,null,28585,10115.904593320327,{"$f":"VLOOKUP(E1542,'[1]Combined AA and BB'!$A$1:$C$6133,3,FALSE)","v":"Y"}]
[null,null,null,null,28600,179.82216601985061,{"$f":"VLOOKUP(E1543,'[1]Combined AA and BB'!$A$1:$C$6133,3,FALSE)","v":"Y"}]
[null,null,null,null,28605,179.82216601985061,{"$f":"VLOOKUP(E1544,'[1]Combined AA and BB'!$A$1:$C$6133,3,FALSE)","v":"Y"}]
[null,null,null,null,28606,2360.4308567939793,{"$f":"VLOOKUP(E1545,'[1]Combined AA and BB'!$A$1:$C$6133,3,FALSE)","v":"Y"}]
[null,null,null,null,28615,9041.7262968230661,{"$f":"VLOOKUP(E1546,'[1]Combined AA and BB'!$A$1:$C$6133,3,FALSE)","v":"Y"}]
[null,null,null,null,28630,286.9828,{"$f":"VLOOKUP(E1547,'[1]Combined AA and BB'!$A$1:$C$6133,3,FALSE)","v":"Y"}]
[null,null,null,null,28635,1248.9885183021138,{"$f":"VLOOKUP(E1548,'[1]Combined AA and BB'!$A$1:$C$6133,3,FALSE)","v":"Y"}]
[null,null,null,null,28636,2360.4308567939793,{"$f":"VLOOKUP(E1549,'[1]Combined AA and BB'!$A$1:$C$6133,3,FALSE)","v":"Y"}]
[null,null,null,null,28645,2360.4308567939793,{"$f":"VLOOKUP(E1550,'[1]Combined AA and BB'!$A$1:$C$6133,3,FALSE)","v":"Y"}]
[null,null,null,null,28660,232.8014,{"$f":"VLOOKUP(E1551,'[1]Combined AA and BB'!$A$1:$C$6133,3,FALSE)","v":"Y"}]
[null,null,null,null,28665,208.40408917035751,{"$f":"VLOOKUP(E1552,'[1]Combined AA and BB'!$A$1:$C$6133,3,FALSE)","v":"Y"}]
[null,null,null,null,28666,2360.4308567939793,{"$f":"VLOOKUP(E1553,'[1]Combined AA and BB'!$A$1:$C$6133,3,FALSE)","v":"Y"}]
[null,null,null,null,28675,2360.4308567939793,{"$f":"VLOOKUP(E1554,'[1]Combined AA and BB'!$A$1:$C$6133,3,FALSE)","v":"Y"}]
[null,null,null,null,28705,33481.191957202238,{"$f":"VLOOKUP(E1555,'[1]Combined AA and BB'!$A$1:$C$6133,3,FALSE)","v":"Y"}]
[null,null,null,null,28715,21215.633165417486,{"$f":"VLOOKUP(E1556,'[1]Combined AA and BB'!$A$1:$C$6133,3,FALSE)","v":"Y"}]
[null,null,null,null,28725,20396.536786294237,{"$f":"VLOOKUP(E1557,'[1]Combined AA and BB'!$A$1:$C$6133,3,FALSE)","v":"Y"}]
[null,null,null,null,28730,21245.557768754221,{"$f":"VLOOKUP(E1558,'[1]Combined AA and BB'!$A$1:$C$6133,3,FALSE)","v":"Y"}]
[null,null,null,null,28735,21098.632405547443,{"$f":"VLOOKUP(E1559,'[1]Combined AA and BB'!$A$1:$C$6133,3,FALSE)","v":"Y"}]
[null,null,null,null,28737,21326.157280442105,{"$f":"VLOOKUP(E1560,'[1]Combined AA and BB'!$A$1:$C$6133,3,FALSE)","v":"Y"}]
[null,null,null,null,28740,9984.6415557854234,{"$f":"VLOOKUP(E1561,'[1]Combined AA and BB'!$A$1:$C$6133,3,FALSE)","v":"Y"}]
[null,null,null,null,28750,9919.3287471333879,{"$f":"VLOOKUP(E1562,'[1]Combined AA and BB'!$A$1:$C$6133,3,FALSE)","v":"Y"}]
[null,null,null,null,28755,5235.154665531295,{"$f":"VLOOKUP(E1563,'[1]Combined AA and BB'!$A$1:$C$6133,3,FALSE)","v":"Y"}]
[null,null,null,null,28760,5235.154665531295,{"$f":"VLOOKUP(E1564,'[1]Combined AA and BB'!$A$1:$C$6133,3,FALSE)","v":"Y"}]
[null,null,null,null,28810,2360.4308567939793,{"$f":"VLOOKUP(E1565,'[1]Combined AA and BB'!$A$1:$C$6133,3,FALSE)","v":"Y"}]
[null,null,null,null,28820,2360.4308567939793,{"$f":"VLOOKUP(E1566,'[1]Combined AA and BB'!$A$1:$C$6133,3,FALSE)","v":"Y"}]
[null,null,null,null,28825,2360.4308567939793,{"$f":"VLOOKUP(E1567,'[1]Combined AA and BB'!$A$1:$C$6133,3,FALSE)","v":"Y"}]
[null,null,null,null,28890,"Not covered","NA"]
[null,null,null,null,29000,208.40408917035751,{"$f":"VLOOKUP(E1569,'[1]Combined AA and BB'!$A$1:$C$6133,3,FALSE)","v":"Y"}]
[null,null,null,null,29010,208.40408917035751,{"$f":"VLOOKUP(E1570,'[1]Combined AA and BB'!$A$1:$C$6133,3,FALSE)","v":"Y"}]
[null,null,null,null,29015,208.40408917035751,{"$f":"VLOOKUP(E1571,'[1]Combined AA and BB'!$A$1:$C$6133,3,FALSE)","v":"Y"}]
[null,null,null,null,29035,208.40408917035751,{"$f":"VLOOKUP(E1572,'[1]Combined AA and BB'!$A$1:$C$6133,3,FALSE)","v":"Y"}]
[null,null,null,null,29040,208.40408917035751,{"$f":"VLOOKUP(E1573,'[1]Combined AA and BB'!$A$1:$C$6133,3,FALSE)","v":"Y"}]
[null,null,null,null,29044,126.61169105048992,{"$f":"VLOOKUP(E1574,'[1]Combined AA and BB'!$A$1:$C$6133,3,FALSE)","v":"Y"}]
[null,null,null,null,29046,208.40408917035751,{"$f":"VLOOKUP(E1575,'[1]Combined AA and BB'!$A$1:$C$6133,3,FALSE)","v":"Y"}]
[null,null,null,null,29049,185.76480000000001,{"$f":"VLOOKUP(E1576,'[1]Combined AA and BB'!$A$1:$C$6133,3,FALSE)","v":"Y"}]
[null,null,null,null,29055,208.40408917035751,{"$f":"VLOOKUP(E1577,'[1]Combined AA and BB'!$A$1:$C$6133,3,FALSE)","v":"Y"}]
[null,null,null,null,29058,229.22900000000001,{"$f":"VLOOKUP(E1578,'[1]Combined AA and BB'!$A$1:$C$6133,3,FALSE)","v":"Y"}]
[null,null,null,null,29065,181.0016,{"$f":"VLOOKUP(E1579,'[1]Combined AA and BB'!$A$1:$C$6133,3,FALSE)","v":"Y"}]
[null,null,null,null,29075,164.3304,{"$f":"VLOOKUP(E1580,'[1]Combined AA and BB'!$A$1:$C$6133,3,FALSE)","v":"Y"}]
[null,null,null,null,29085,179.8108,{"$f":"VLOOKUP(E1581,'[1]Combined AA and BB'!$A$1:$C$6133,3,FALSE)","v":"Y"}]
[null,null,null,null,29086,144.08679999999998,{"$f":"VLOOKUP(E1582,'[1]Combined AA and BB'!$A$1:$C$6133,3,FALSE)","v":"Y"}]
[null,null,null,null,29105,154.20859999999999,{"$f":"VLOOKUP(E1583,'[1]Combined AA and BB'!$A$1:$C$6133,3,FALSE)","v":"Y"}]
[null,null,null,null,29125,"Bundled","NA"]
[null,null,null,null,29126,"Bundled","NA"]
[null,null,null,null,29130,"Bundled","NA"]
[null,null,null,null,29131,"Bundled","NA"]
[null,null,null,null,29200,60.135399999999997,{"$f":"VLOOKUP(E1588,'[1]Combined AA and BB'!$A$1:$C$6133,3,FALSE)","v":"Y"}]
[null,null,null,null,29240,"Bundled","NA"]
[null,null,null,null,29260,"Bundled","NA"]
[null,null,null,null,29280,"Bundled","NA"]
[null,null,null,null,29305,208.40408917035751,{"$f":"VLOOKUP(E1592,'[1]Combined AA and BB'!$A$1:$C$6133,3,FALSE)","v":"Y"}]
[null,null,null,null,29325,208.40408917035751,{"$f":"VLOOKUP(E1593,'[1]Combined AA and BB'!$A$1:$C$6133,3,FALSE)","v":"Y"}]
[null,null,null,null,29345,251.85420000000002,{"$f":"VLOOKUP(E1594,'[1]Combined AA and BB'!$A$1:$C$6133,3,FALSE)","v":"Y"}]
[null,null,null,null,29355,263.76220000000001,{"$f":"VLOOKUP(E1595,'[1]Combined AA and BB'!$A$1:$C$6133,3,FALSE)","v":"Y"}]
[null,null,null,null,29358,300.08159999999998,{"$f":"VLOOKUP(E1596,'[1]Combined AA and BB'!$A$1:$C$6133,3,FALSE)","v":"Y"}]
[null,null,null,null,29365,231.01519999999999,{"$f":"VLOOKUP(E1597,'[1]Combined AA and BB'!$A$1:$C$6133,3,FALSE)","v":"Y"}]
[null,null,null,null,29405,148.85,{"$f":"VLOOKUP(E1598,'[1]Combined AA and BB'!$A$1:$C$6133,3,FALSE)","v":"Y"}]
[null,null,null,null,29425,139.3236,{"$f":"VLOOKUP(E1599,'[1]Combined AA and BB'!$A$1:$C$6133,3,FALSE)","v":"Y"}]
[null,null,null,null,29435,213.74859999999998,{"$f":"VLOOKUP(E1600,'[1]Combined AA and BB'!$A$1:$C$6133,3,FALSE)","v":"Y"}]
[null,null,null,null,29440,78.592799999999997,{"$f":"VLOOKUP(E1601,'[1]Combined AA and BB'!$A$1:$C$6133,3,FALSE)","v":"Y"}]
[null,null,null,null,29445,235.18300000000002,{"$f":"VLOOKUP(E1602,'[1]Combined AA and BB'!$A$1:$C$6133,3,FALSE)","v":"Y"}]
[null,null,null,null,29450,"Not covered","NA"]
[null,null,null,null,29505,166.11660000000001,{"$f":"VLOOKUP(E1604,'[1]Combined AA and BB'!$A$1:$C$6133,3,FALSE)","v":"Y"}]
[null,null,null,null,29515,133.36960000000002,{"$f":"VLOOKUP(E1605,'[1]Combined AA and BB'!$A$1:$C$6133,3,FALSE)","v":"Y"}]
[null,null,null,null,29520,"Bundled","NA"]
[null,null,null,null,29530,"Bundled","NA"]
[null,null,null,null,29540,51.799799999999998,{"$f":"VLOOKUP(E1608,'[1]Combined AA and BB'!$A$1:$C$6133,3,FALSE)","v":"Y"}]
[null,null,null,null,29550,"Bundled","NA"]
[null,null,null,null,29580,117.8892,{"$f":"VLOOKUP(E1610,'[1]Combined AA and BB'!$A$1:$C$6133,3,FALSE)","v":"Y"}]
[null,null,null,null,29581,169.09359999999998,{"$f":"VLOOKUP(E1611,'[1]Combined AA and BB'!$A$1:$C$6133,3,FALSE)","v":"Y"}]
[null,null,null,null,29584,155.9948,{"$f":"VLOOKUP(E1612,'[1]Combined AA and BB'!$A$1:$C$6133,3,FALSE)","v":"Y"}]
[null,null,null,null,29700,116.10299999999999,{"$f":"VLOOKUP(E1613,'[1]Combined AA and BB'!$A$1:$C$6133,3,FALSE)","v":"Y"}]
[null,null,null,null,29705,115.5076,{"$f":"VLOOKUP(E1614,'[1]Combined AA and BB'!$A$1:$C$6133,3,FALSE)","v":"Y"}]
[null,null,null,null,29710,225.6566,{"$f":"VLOOKUP(E1615,'[1]Combined AA and BB'!$A$1:$C$6133,3,FALSE)","v":"Y"}]
[null,null,null,null,29720,160.75800000000001,{"$f":"VLOOKUP(E1616,'[1]Combined AA and BB'!$A$1:$C$6133,3,FALSE)","v":"Y"}]
[null,null,null,null,29730,117.8892,{"$f":"VLOOKUP(E1617,'[1]Combined AA and BB'!$A$1:$C$6133,3,FALSE)","v":"Y"}]
[null,null,null,null,29740,181.59699999999998,{"$f":"VLOOKUP(E1618,'[1]Combined AA and BB'!$A$1:$C$6133,3,FALSE)","v":"Y"}]
[null,null,null,null,29750,"Not covered","NA"]
[null,null,null,null,29800,2360.4308567939793,{"$f":"VLOOKUP(E1620,'[1]Combined AA and BB'!$A$1:$C$6133,3,FALSE)","v":"Y"}]
[null,null,null,null,29804,2360.4308567939793,{"$f":"VLOOKUP(E1621,'[1]Combined AA and BB'!$A$1:$C$6133,3,FALSE)","v":"Y"}]
[null,null,null,null,29805,2360.4308567939793,{"$f":"VLOOKUP(E1622,'[1]Combined AA and BB'!$A$1:$C$6133,3,FALSE)","v":"Y"}]
[null,null,null,null,29806,5235.154665531295,{"$f":"VLOOKUP(E1623,'[1]Combined AA and BB'!$A$1:$C$6133,3,FALSE)","v":"Y"}]
[null,null,null,null,29807,5235.154665531295,{"$f":"VLOOKUP(E1624,'[1]Combined AA and BB'!$A$1:$C$6133,3,FALSE)","v":"Y"}]
[null,null,null,null,29819,2360.4308567939793,{"$f":"VLOOKUP(E1625,'[1]Combined AA and BB'!$A$1:$C$6133,3,FALSE)","v":"Y"}]
[null,null,null,null,29820,5235.154665531295,{"$f":"VLOOKUP(E1626,'[1]Combined AA and BB'!$A$1:$C$6133,3,FALSE)","v":"Y"}]
[null,null,null,null,29821,2360.4308567939793,{"$f":"VLOOKUP(E1627,'[1]Combined AA and BB'!$A$1:$C$6133,3,FALSE)","v":"Y"}]
[null,null,null,null,29822,2360.4308567939793,{"$f":"VLOOKUP(E1628,'[1]Combined AA and BB'!$A$1:$C$6133,3,FALSE)","v":"Y"}]
[null,null,null,null,29823,2360.4308567939793,{"$f":"VLOOKUP(E1629,'[1]Combined AA and BB'!$A$1:$C$6133,3,FALSE)","v":"Y"}]
[null,null,null,null,29824,2360.4308567939793,{"$f":"VLOOKUP(E1630,'[1]Combined AA and BB'!$A$1:$C$6133,3,FALSE)","v":"Y"}]
[null,null,null,null,29825,2360.4308567939793,{"$f":"VLOOKUP(E1631,'[1]Combined AA and BB'!$A$1:$C$6133,3,FALSE)","v":"Y"}]
[null,null,null,null,29826,"Bundled","NA"]
[null,null,null,null,29827,5235.154665531295,{"$f":"VLOOKUP(E1633,'[1]Combined AA and BB'!$A$1:$C$6133,3,FALSE)","v":"Y"}]
[null,null,null,null,29828,5235.154665531295,{"$f":"VLOOKUP(E1634,'[1]Combined AA and BB'!$A$1:$C$6133,3,FALSE)","v":"Y"}]
[null,null,null,null,29830,2360.4308567939793,{"$f":"VLOOKUP(E1635,'[1]Combined AA and BB'!$A$1:$C$6133,3,FALSE)","v":"Y"}]
[null,null,null,null,29834,2360.4308567939793,{"$f":"VLOOKUP(E1636,'[1]Combined AA and BB'!$A$1:$C$6133,3,FALSE)","v":"Y"}]
[null,null,null,null,29835,2360.4308567939793,{"$f":"VLOOKUP(E1637,'[1]Combined AA and BB'!$A$1:$C$6133,3,FALSE)","v":"Y"}]
[null,null,null,null,29836,5235.154665531295,{"$f":"VLOOKUP(E1638,'[1]Combined AA and BB'!$A$1:$C$6133,3,FALSE)","v":"Y"}]
[null,null,null,null,29837,2360.4308567939793,{"$f":"VLOOKUP(E1639,'[1]Combined AA and BB'!$A$1:$C$6133,3,FALSE)","v":"Y"}]
[null,null,null,null,29838,2360.4308567939793,{"$f":"VLOOKUP(E1640,'[1]Combined AA and BB'!$A$1:$C$6133,3,FALSE)","v":"Y"}]
[null,null,null,null,29840,2360.4308567939793,{"$f":"VLOOKUP(E1641,'[1]Combined AA and BB'!$A$1:$C$6133,3,FALSE)","v":"Y"}]
[null,null,null,null,29843,2360.4308567939793,{"$f":"VLOOKUP(E1642,'[1]Combined AA and BB'!$A$1:$C$6133,3,FALSE)","v":"Y"}]
[null,null,null,null,29844,2360.4308567939793,{"$f":"VLOOKUP(E1643,'[1]Combined AA and BB'!$A$1:$C$6133,3,FALSE)","v":"Y"}]
[null,null,null,null,29845,2360.4308567939793,{"$f":"VLOOKUP(E1644,'[1]Combined AA and BB'!$A$1:$C$6133,3,FALSE)","v":"Y"}]
[null,null,null,null,29846,2360.4308567939793,{"$f":"VLOOKUP(E1645,'[1]Combined AA and BB'!$A$1:$C$6133,3,FALSE)","v":"Y"}]
[null,null,null,null,29847,5235.154665531295,{"$f":"VLOOKUP(E1646,'[1]Combined AA and BB'!$A$1:$C$6133,3,FALSE)","v":"Y"}]
[null,null,null,null,29848,1248.9885183021138,{"$f":"VLOOKUP(E1647,'[1]Combined AA and BB'!$A$1:$C$6133,3,FALSE)","v":"Y"}]
[null,null,null,null,29850,1248.9885183021138,{"$f":"VLOOKUP(E1648,'[1]Combined AA and BB'!$A$1:$C$6133,3,FALSE)","v":"Y"}]
[null,null,null,null,29851,1248.9885183021138,{"$f":"VLOOKUP(E1649,'[1]Combined AA and BB'!$A$1:$C$6133,3,FALSE)","v":"Y"}]
[null,null,null,null,29855,10045.503805325759,{"$f":"VLOOKUP(E1650,'[1]Combined AA and BB'!$A$1:$C$6133,3,FALSE)","v":"Y"}]
[null,null,null,null,29856,24550.638578138751,{"$f":"VLOOKUP(E1651,'[1]Combined AA and BB'!$A$1:$C$6133,3,FALSE)","v":"Y"}]
[null,null,null,null,29860,5235.154665531295,{"$f":"VLOOKUP(E1652,'[1]Combined AA and BB'!$A$1:$C$6133,3,FALSE)","v":"Y"}]
[null,null,null,null,29861,5235.154665531295,{"$f":"VLOOKUP(E1653,'[1]Combined AA and BB'!$A$1:$C$6133,3,FALSE)","v":"Y"}]
[null,null,null,null,29862,5235.154665531295,{"$f":"VLOOKUP(E1654,'[1]Combined AA and BB'!$A$1:$C$6133,3,FALSE)","v":"Y"}]
[null,null,null,null,29863,2360.4308567939793,{"$f":"VLOOKUP(E1655,'[1]Combined AA and BB'!$A$1:$C$6133,3,FALSE)","v":"Y"}]
[null,null,null,null,29866,5235.154665531295,{"$f":"VLOOKUP(E1656,'[1]Combined AA and BB'!$A$1:$C$6133,3,FALSE)","v":"Y"}]
[null,null,null,null,29867,18155.003014557024,{"$f":"VLOOKUP(E1657,'[1]Combined AA and BB'!$A$1:$C$6133,3,FALSE)","v":"Y"}]
[null,null,null,null,29868,"Not covered","NA"]
[null,null,null,null,29870,2360.4308567939793,{"$f":"VLOOKUP(E1659,'[1]Combined AA and BB'!$A$1:$C$6133,3,FALSE)","v":"Y"}]
[null,null,null,null,29871,2360.4308567939793,{"$f":"VLOOKUP(E1660,'[1]Combined AA and BB'!$A$1:$C$6133,3,FALSE)","v":"Y"}]
[null,null,null,null,29873,2360.4308567939793,{"$f":"VLOOKUP(E1661,'[1]Combined AA and BB'!$A$1:$C$6133,3,FALSE)","v":"Y"}]
[null,null,null,null,29874,2360.4308567939793,{"$f":"VLOOKUP(E1662,'[1]Combined AA and BB'!$A$1:$C$6133,3,FALSE)","v":"Y"}]
[null,null,null,null,29875,2360.4308567939793,{"$f":"VLOOKUP(E1663,'[1]Combined AA and BB'!$A$1:$C$6133,3,FALSE)","v":"Y"}]
[null,null,null,null,29876,2360.4308567939793,{"$f":"VLOOKUP(E1664,'[1]Combined AA and BB'!$A$1:$C$6133,3,FALSE)","v":"Y"}]
[null,null,null,null,29877,2360.4308567939793,{"$f":"VLOOKUP(E1665,'[1]Combined AA and BB'!$A$1:$C$6133,3,FALSE)","v":"Y"}]
[null,null,null,null,29879,2360.4308567939793,{"$f":"VLOOKUP(E1666,'[1]Combined AA and BB'!$A$1:$C$6133,3,FALSE)","v":"Y"}]
[null,null,null,null,29880,2360.4308567939793,{"$f":"VLOOKUP(E1667,'[1]Combined AA and BB'!$A$1:$C$6133,3,FALSE)","v":"Y"}]
[null,null,null,null,29881,2360.4308567939793,{"$f":"VLOOKUP(E1668,'[1]Combined AA and BB'!$A$1:$C$6133,3,FALSE)","v":"Y"}]
[null,null,null,null,29882,2360.4308567939793,{"$f":"VLOOKUP(E1669,'[1]Combined AA and BB'!$A$1:$C$6133,3,FALSE)","v":"Y"}]
[null,null,null,null,29883,2360.4308567939793,{"$f":"VLOOKUP(E1670,'[1]Combined AA and BB'!$A$1:$C$6133,3,FALSE)","v":"Y"}]
[null,null,null,null,29884,2360.4308567939793,{"$f":"VLOOKUP(E1671,'[1]Combined AA and BB'!$A$1:$C$6133,3,FALSE)","v":"Y"}]
[null,null,null,null,29885,8803.3197479877763,{"$f":"VLOOKUP(E1672,'[1]Combined AA and BB'!$A$1:$C$6133,3,FALSE)","v":"Y"}]
[null,null,null,null,29886,2360.4308567939793,{"$f":"VLOOKUP(E1673,'[1]Combined AA and BB'!$A$1:$C$6133,3,FALSE)","v":"Y"}]
[null,null,null,null,29887,5235.154665531295,{"$f":"VLOOKUP(E1674,'[1]Combined AA and BB'!$A$1:$C$6133,3,FALSE)","v":"Y"}]
[null,null,null,null,29888,9310.6038091929513,{"$f":"VLOOKUP(E1675,'[1]Combined AA and BB'!$A$1:$C$6133,3,FALSE)","v":"Y"}]
[null,null,null,null,29889,19490.284573108846,{"$f":"VLOOKUP(E1676,'[1]Combined AA and BB'!$A$1:$C$6133,3,FALSE)","v":"Y"}]
[null,null,null,null,29891,2360.4308567939793,{"$f":"VLOOKUP(E1677,'[1]Combined AA and BB'!$A$1:$C$6133,3,FALSE)","v":"Y"}]
[null,null,null,null,29892,5235.154665531295,{"$f":"VLOOKUP(E1678,'[1]Combined AA and BB'!$A$1:$C$6133,3,FALSE)","v":"Y"}]
[null,null,null,null,29893,2360.4308567939793,{"$f":"VLOOKUP(E1679,'[1]Combined AA and BB'!$A$1:$C$6133,3,FALSE)","v":"Y"}]
[null,null,null,null,29894,2360.4308567939793,{"$f":"VLOOKUP(E1680,'[1]Combined AA and BB'!$A$1:$C$6133,3,FALSE)","v":"Y"}]
[null,null,null,null,29895,2360.4308567939793,{"$f":"VLOOKUP(E1681,'[1]Combined AA and BB'!$A$1:$C$6133,3,FALSE)","v":"Y"}]
[null,null,null,null,29897,2360.4308567939793,{"$f":"VLOOKUP(E1682,'[1]Combined AA and BB'!$A$1:$C$6133,3,FALSE)","v":"Y"}]
[null,null,null,null,29898,2360.4308567939793,{"$f":"VLOOKUP(E1683,'[1]Combined AA and BB'!$A$1:$C$6133,3,FALSE)","v":"Y"}]
[null,null,null,null,29899,9290.9462245742543,{"$f":"VLOOKUP(E1684,'[1]Combined AA and BB'!$A$1:$C$6133,3,FALSE)","v":"Y"}]
[null,null,null,null,29900,2360.4308567939793,{"$f":"VLOOKUP(E1685,'[1]Combined AA and BB'!$A$1:$C$6133,3,FALSE)","v":"Y"}]
[null,null,null,null,29901,2360.4308567939793,{"$f":"VLOOKUP(E1686,'[1]Combined AA and BB'!$A$1:$C$6133,3,FALSE)","v":"Y"}]
[null,null,null,null,29902,1248.9885183021138,{"$f":"VLOOKUP(E1687,'[1]Combined AA and BB'!$A$1:$C$6133,3,FALSE)","v":"Y"}]
[null,null,null,null,29904,2360.4308567939793,{"$f":"VLOOKUP(E1688,'[1]Combined AA and BB'!$A$1:$C$6133,3,FALSE)","v":"Y"}]
[null,null,null,null,29905,8969.4701606566086,{"$f":"VLOOKUP(E1689,'[1]Combined AA and BB'!$A$1:$C$6133,3,FALSE)","v":"Y"}]
[null,null,null,null,29906,2360.4308567939793,{"$f":"VLOOKUP(E1690,'[1]Combined AA and BB'!$A$1:$C$6133,3,FALSE)","v":"Y"}]
[null,null,null,null,29907,20527.845353845631,{"$f":"VLOOKUP(E1691,'[1]Combined AA and BB'!$A$1:$C$6133,3,FALSE)","v":"Y"}]
[null,null,null,null,29914,"Not covered","NA"]
[null,null,null,null,29915,"Not covered","NA"]
[null,null,null,null,29916,5235.154665531295,{"$f":"VLOOKUP(E1694,'[1]Combined AA and BB'!$A$1:$C$6133,3,FALSE)","v":"Y"}]
[null,null,null,null,29999,"UR/BR","N"]
[null,null,null,null,30000,180.53152367673368,{"$f":"VLOOKUP(E1696,'[1]Combined AA and BB'!$A$1:$C$6133,3,FALSE)","v":"Y"}]
[null,null,null,null,30020,517.40260000000001,{"$f":"VLOOKUP(E1697,'[1]Combined AA and BB'!$A$1:$C$6133,3,FALSE)","v":"Y"}]
[null,null,null,null,30100,268.52539999999999,{"$f":"VLOOKUP(E1698,'[1]Combined AA and BB'!$A$1:$C$6133,3,FALSE)","v":"Y"}]
[null,null,null,null,30110,472.74760000000003,{"$f":"VLOOKUP(E1699,'[1]Combined AA and BB'!$A$1:$C$6133,3,FALSE)","v":"Y"}]
[null,null,null,null,30115,1916.5286762415849,{"$f":"VLOOKUP(E1700,'[1]Combined AA and BB'!$A$1:$C$6133,3,FALSE)","v":"Y"}]
[null,null,null,null,30117,1916.5286762415849,{"$f":"VLOOKUP(E1701,'[1]Combined AA and BB'!$A$1:$C$6133,3,FALSE)","v":"Y"}]
[null,null,null,null,30118,1916.5286762415849,{"$f":"VLOOKUP(E1702,'[1]Combined AA and BB'!$A$1:$C$6133,3,FALSE)","v":"Y"}]
[null,null,null,null,30120,"Not covered","NA"]
[null,null,null,null,30124,"Not covered","NA"]
[null,null,null,null,30125,"Not covered","NA"]
[null,null,null,null,30130,1916.5286762415849,{"$f":"VLOOKUP(E1706,'[1]Combined AA and BB'!$A$1:$C$6133,3,FALSE)","v":"Y"}]
[null,null,null,null,30140,1916.5286762415849,{"$f":"VLOOKUP(E1707,'[1]Combined AA and BB'!$A$1:$C$6133,3,FALSE)","v":"Y"}]
[null,null,null,null,30150,4253.3690655926366,{"$f":"VLOOKUP(E1708,'[1]Combined AA and BB'!$A$1:$C$6133,3,FALSE)","v":"Y"}]
[null,null,null,null,30160,4253.3690655926366,{"$f":"VLOOKUP(E1709,'[1]Combined AA and BB'!$A$1:$C$6133,3,FALSE)","v":"Y"}]
[null,null,null,null,30200,210.77160000000001,{"$f":"VLOOKUP(E1710,'[1]Combined AA and BB'!$A$1:$C$6133,3,FALSE)","v":"Y"}]
[null,null,null,null,30210,285.19659999999999,{"$f":"VLOOKUP(E1711,'[1]Combined AA and BB'!$A$1:$C$6133,3,FALSE)","v":"Y"}]
[null,null,null,null,30220,985.80817689537298,{"$f":"VLOOKUP(E1712,'[1]Combined AA and BB'!$A$1:$C$6133,3,FALSE)","v":"Y"}]
[null,null,null,null,30300,"Bundled","NA"]
[null,null,null,null,30310,1916.5286762415849,{"$f":"VLOOKUP(E1714,'[1]Combined AA and BB'!$A$1:$C$6133,3,FALSE)","v":"Y"}]
[null,null,null,null,30320,985.80817689537298,{"$f":"VLOOKUP(E1715,'[1]Combined AA and BB'!$A$1:$C$6133,3,FALSE)","v":"Y"}]
[null,null,null,null,30400,4253.3690655926366,{"$f":"VLOOKUP(E1716,'[1]Combined AA and BB'!$A$1:$C$6133,3,FALSE)","v":"Y"}]
[null,null,null,null,30410,4253.3690655926366,{"$f":"VLOOKUP(E1717,'[1]Combined AA and BB'!$A$1:$C$6133,3,FALSE)","v":"Y"}]
[null,null,null,null,30420,4253.3690655926366,{"$f":"VLOOKUP(E1718,'[1]Combined AA and BB'!$A$1:$C$6133,3,FALSE)","v":"Y"}]
[null,null,null,null,30430,4253.3690655926366,{"$f":"VLOOKUP(E1719,'[1]Combined AA and BB'!$A$1:$C$6133,3,FALSE)","v":"Y"}]
[null,null,null,null,30435,4253.3690655926366,{"$f":"VLOOKUP(E1720,'[1]Combined AA and BB'!$A$1:$C$6133,3,FALSE)","v":"Y"}]
[null,null,null,null,30450,4253.3690655926366,{"$f":"VLOOKUP(E1721,'[1]Combined AA and BB'!$A$1:$C$6133,3,FALSE)","v":"Y"}]
[null,null,null,null,30460,"Not covered","NA"]
[null,null,null,null,30462,"Not covered","NA"]
[null,null,null,null,30465,4253.3690655926366,{"$f":"VLOOKUP(E1724,'[1]Combined AA and BB'!$A$1:$C$6133,3,FALSE)","v":"Y"}]
[null,null,null,null,30468,8068.3514568302362,{"$f":"VLOOKUP(E1725,'[1]Combined AA and BB'!$A$1:$C$6133,3,FALSE)","v":"Y"}]
[null,null,null,null,30469,7193.5832500462911,{"$f":"VLOOKUP(E1726,'[1]Combined AA and BB'!$A$1:$C$6133,3,FALSE)","v":"Y"}]
[null,null,null,null,30520,1916.5286762415849,{"$f":"VLOOKUP(E1727,'[1]Combined AA and BB'!$A$1:$C$6133,3,FALSE)","v":"Y"}]
[null,null,null,null,30540,"Not covered","NA"]
[null,null,null,null,30545,"Not covered","NA"]
[null,null,null,null,30560,396.81640340099921,{"$f":"VLOOKUP(E1730,'[1]Combined AA and BB'!$A$1:$C$6133,3,FALSE)","v":"Y"}]
[null,null,null,null,30580,4253.3690655926366,{"$f":"VLOOKUP(E1731,'[1]Combined AA and BB'!$A$1:$C$6133,3,FALSE)","v":"Y"}]
[null,null,null,null,30600,4253.3690655926366,{"$f":"VLOOKUP(E1732,'[1]Combined AA and BB'!$A$1:$C$6133,3,FALSE)","v":"Y"}]
[null,null,null,null,30620,4253.3690655926366,{"$f":"VLOOKUP(E1733,'[1]Combined AA and BB'!$A$1:$C$6133,3,FALSE)","v":"Y"}]
[null,null,null,null,30630,1916.5286762415849,{"$f":"VLOOKUP(E1734,'[1]Combined AA and BB'!$A$1:$C$6133,3,FALSE)","v":"Y"}]
[null,null,null,null,30801,985.80817689537298,{"$f":"VLOOKUP(E1735,'[1]Combined AA and BB'!$A$1:$C$6133,3,FALSE)","v":"Y"}]
[null,null,null,null,30802,985.80817689537298,{"$f":"VLOOKUP(E1736,'[1]Combined AA and BB'!$A$1:$C$6133,3,FALSE)","v":"Y"}]
[null,null,null,null,30901,"Bundled","NA"]
[null,null,null,null,30903,100.85854782438247,{"$f":"VLOOKUP(E1738,'[1]Combined AA and BB'!$A$1:$C$6133,3,FALSE)","v":"Y"}]
[null,null,null,null,30905,100.85854782438247,{"$f":"VLOOKUP(E1739,'[1]Combined AA and BB'!$A$1:$C$6133,3,FALSE)","v":"Y"}]
[null,null,null,null,30906,180.53152367673368,{"$f":"VLOOKUP(E1740,'[1]Combined AA and BB'!$A$1:$C$6133,3,FALSE)","v":"Y"}]
[null,null,null,null,30915,2408.9180478528747,{"$f":"VLOOKUP(E1741,'[1]Combined AA and BB'!$A$1:$C$6133,3,FALSE)","v":"Y"}]
[null,null,null,null,30920,2408.9180478528747,{"$f":"VLOOKUP(E1742,'[1]Combined AA and BB'!$A$1:$C$6133,3,FALSE)","v":"Y"}]
[null,null,null,null,30930,1916.5286762415849,{"$f":"VLOOKUP(E1743,'[1]Combined AA and BB'!$A$1:$C$6133,3,FALSE)","v":"Y"}]
[null,null,null,null,31000,180.53152367673368,{"$f":"VLOOKUP(E1744,'[1]Combined AA and BB'!$A$1:$C$6133,3,FALSE)","v":"Y"}]
[null,null,null,null,31002,985.80817689537298,{"$f":"VLOOKUP(E1745,'[1]Combined AA and BB'!$A$1:$C$6133,3,FALSE)","v":"Y"}]
[null,null,null,null,31020,1916.5286762415849,{"$f":"VLOOKUP(E1746,'[1]Combined AA and BB'!$A$1:$C$6133,3,FALSE)","v":"Y"}]
[null,null,null,null,31030,4253.3690655926366,{"$f":"VLOOKUP(E1747,'[1]Combined AA and BB'!$A$1:$C$6133,3,FALSE)","v":"Y"}]
[null,null,null,null,31032,4253.3690655926366,{"$f":"VLOOKUP(E1748,'[1]Combined AA and BB'!$A$1:$C$6133,3,FALSE)","v":"Y"}]
[null,null,null,null,31040,4253.3690655926366,{"$f":"VLOOKUP(E1749,'[1]Combined AA and BB'!$A$1:$C$6133,3,FALSE)","v":"Y"}]
[null,null,null,null,31050,4253.3690655926366,{"$f":"VLOOKUP(E1750,'[1]Combined AA and BB'!$A$1:$C$6133,3,FALSE)","v":"Y"}]
[null,null,null,null,31051,4253.3690655926366,{"$f":"VLOOKUP(E1751,'[1]Combined AA and BB'!$A$1:$C$6133,3,FALSE)","v":"Y"}]
[null,null,null,null,31070,4253.3690655926366,{"$f":"VLOOKUP(E1752,'[1]Combined AA and BB'!$A$1:$C$6133,3,FALSE)","v":"Y"}]
[null,null,null,null,31075,4253.3690655926366,{"$f":"VLOOKUP(E1753,'[1]Combined AA and BB'!$A$1:$C$6133,3,FALSE)","v":"Y"}]
[null,null,null,null,31080,4253.3690655926366,{"$f":"VLOOKUP(E1754,'[1]Combined AA and BB'!$A$1:$C$6133,3,FALSE)","v":"Y"}]
[null,null,null,null,31081,4253.3690655926366,{"$f":"VLOOKUP(E1755,'[1]Combined AA and BB'!$A$1:$C$6133,3,FALSE)","v":"Y"}]
[null,null,null,null,31084,4253.3690655926366,{"$f":"VLOOKUP(E1756,'[1]Combined AA and BB'!$A$1:$C$6133,3,FALSE)","v":"Y"}]
[null,null,null,null,31085,7401.2228902398165,{"$f":"VLOOKUP(E1757,'[1]Combined AA and BB'!$A$1:$C$6133,3,FALSE)","v":"Y"}]
[null,null,null,null,31086,4253.3690655926366,{"$f":"VLOOKUP(E1758,'[1]Combined AA and BB'!$A$1:$C$6133,3,FALSE)","v":"Y"}]
[null,null,null,null,31087,4253.3690655926366,{"$f":"VLOOKUP(E1759,'[1]Combined AA and BB'!$A$1:$C$6133,3,FALSE)","v":"Y"}]
[null,null,null,null,31090,4253.3690655926366,{"$f":"VLOOKUP(E1760,'[1]Combined AA and BB'!$A$1:$C$6133,3,FALSE)","v":"Y"}]
[null,null,null,null,31200,4253.3690655926366,{"$f":"VLOOKUP(E1761,'[1]Combined AA and BB'!$A$1:$C$6133,3,FALSE)","v":"Y"}]
[null,null,null,null,31201,985.80817689537298,{"$f":"VLOOKUP(E1762,'[1]Combined AA and BB'!$A$1:$C$6133,3,FALSE)","v":"Y"}]
[null,null,null,null,31205,1916.5286762415849,{"$f":"VLOOKUP(E1763,'[1]Combined AA and BB'!$A$1:$C$6133,3,FALSE)","v":"Y"}]
[null,null,null,null,31231,155.27147052919128,{"$f":"VLOOKUP(E1764,'[1]Combined AA and BB'!$A$1:$C$6133,3,FALSE)","v":"Y"}]
[null,null,null,null,31233,327.60212763610645,{"$f":"VLOOKUP(E1765,'[1]Combined AA and BB'!$A$1:$C$6133,3,FALSE)","v":"Y"}]
[null,null,null,null,31235,1170.9418746387137,{"$f":"VLOOKUP(E1766,'[1]Combined AA and BB'!$A$1:$C$6133,3,FALSE)","v":"Y"}]
[null,null,null,null,31237,1170.9418746387137,{"$f":"VLOOKUP(E1767,'[1]Combined AA and BB'!$A$1:$C$6133,3,FALSE)","v":"Y"}]
[null,null,null,null,31238,1170.9418746387137,{"$f":"VLOOKUP(E1768,'[1]Combined AA and BB'!$A$1:$C$6133,3,FALSE)","v":"Y"}]
[null,null,null,null,31239,2357.8875500729591,{"$f":"VLOOKUP(E1769,'[1]Combined AA and BB'!$A$1:$C$6133,3,FALSE)","v":"Y"}]
[null,null,null,null,31240,"Not covered","NA"]
[null,null,null,null,31253,3629.0737726136331,{"$f":"VLOOKUP(E1771,'[1]Combined AA and BB'!$A$1:$C$6133,3,FALSE)","v":"Y"}]
[null,null,null,null,31254,3629.0737726136331,{"$f":"VLOOKUP(E1772,'[1]Combined AA and BB'!$A$1:$C$6133,3,FALSE)","v":"Y"}]
[null,null,null,null,31255,3629.0737726136331,{"$f":"VLOOKUP(E1773,'[1]Combined AA and BB'!$A$1:$C$6133,3,FALSE)","v":"Y"}]
[null,null,null,null,31256,2357.8875500729591,{"$f":"VLOOKUP(E1774,'[1]Combined AA and BB'!$A$1:$C$6133,3,FALSE)","v":"Y"}]
[null,null,null,null,31257,3629.0737726136331,{"$f":"VLOOKUP(E1775,'[1]Combined AA and BB'!$A$1:$C$6133,3,FALSE)","v":"Y"}]
[null,null,null,null,31259,3629.0737726136331,{"$f":"VLOOKUP(E1776,'[1]Combined AA and BB'!$A$1:$C$6133,3,FALSE)","v":"Y"}]
[null,null,null,null,31267,3629.0737726136331,{"$f":"VLOOKUP(E1777,'[1]Combined AA and BB'!$A$1:$C$6133,3,FALSE)","v":"Y"}]
[null,null,null,null,31276,3629.0737726136331,{"$f":"VLOOKUP(E1778,'[1]Combined AA and BB'!$A$1:$C$6133,3,FALSE)","v":"Y"}]
[null,null,null,null,31287,3629.0737726136331,{"$f":"VLOOKUP(E1779,'[1]Combined AA and BB'!$A$1:$C$6133,3,FALSE)","v":"Y"}]
[null,null,null,null,31288,3629.0737726136331,{"$f":"VLOOKUP(E1780,'[1]Combined AA and BB'!$A$1:$C$6133,3,FALSE)","v":"Y"}]
[null,null,null,null,31295,3243.1437999999998,{"$f":"VLOOKUP(E1781,'[1]Combined AA and BB'!$A$1:$C$6133,3,FALSE)","v":"Y"}]
[null,null,null,null,31296,3289.585,{"$f":"VLOOKUP(E1782,'[1]Combined AA and BB'!$A$1:$C$6133,3,FALSE)","v":"Y"}]
[null,null,null,null,31297,3218.1369999999997,{"$f":"VLOOKUP(E1783,'[1]Combined AA and BB'!$A$1:$C$6133,3,FALSE)","v":"Y"}]
[null,null,null,null,31298,3629.0737726136331,{"$f":"VLOOKUP(E1784,'[1]Combined AA and BB'!$A$1:$C$6133,3,FALSE)","v":"Y"}]
[null,null,null,null,31300,"Not covered","NA"]
[null,null,null,null,31400,"Not covered","NA"]
[null,null,null,null,31420,"Not covered","NA"]
[null,null,null,null,31500,180.53152367673368,{"$f":"VLOOKUP(E1788,'[1]Combined AA and BB'!$A$1:$C$6133,3,FALSE)","v":"Y"}]
[null,null,null,null,31502,180.53152367673368,{"$f":"VLOOKUP(E1789,'[1]Combined AA and BB'!$A$1:$C$6133,3,FALSE)","v":"Y"}]
[null,null,null,null,31505,171.4752,{"$f":"VLOOKUP(E1790,'[1]Combined AA and BB'!$A$1:$C$6133,3,FALSE)","v":"Y"}]
[null,null,null,null,31510,2357.8875500729591,{"$f":"VLOOKUP(E1791,'[1]Combined AA and BB'!$A$1:$C$6133,3,FALSE)","v":"Y"}]
[null,null,null,null,31511,155.27147052919128,{"$f":"VLOOKUP(E1792,'[1]Combined AA and BB'!$A$1:$C$6133,3,FALSE)","v":"Y"}]
[null,null,null,null,31512,2357.8875500729591,{"$f":"VLOOKUP(E1793,'[1]Combined AA and BB'!$A$1:$C$6133,3,FALSE)","v":"Y"}]
[null,null,null,null,31513,327.60212763610645,{"$f":"VLOOKUP(E1794,'[1]Combined AA and BB'!$A$1:$C$6133,3,FALSE)","v":"Y"}]
[null,null,null,null,31515,327.60212763610645,{"$f":"VLOOKUP(E1795,'[1]Combined AA and BB'!$A$1:$C$6133,3,FALSE)","v":"Y"}]
[null,null,null,null,31520,"Not covered","NA"]
[null,null,null,null,31525,1170.9418746387137,{"$f":"VLOOKUP(E1797,'[1]Combined AA and BB'!$A$1:$C$6133,3,FALSE)","v":"Y"}]
[null,null,null,null,31526,1170.9418746387137,{"$f":"VLOOKUP(E1798,'[1]Combined AA and BB'!$A$1:$C$6133,3,FALSE)","v":"Y"}]
[null,null,null,null,31527,2357.8875500729591,{"$f":"VLOOKUP(E1799,'[1]Combined AA and BB'!$A$1:$C$6133,3,FALSE)","v":"Y"}]
[null,null,null,null,31528,2357.8875500729591,{"$f":"VLOOKUP(E1800,'[1]Combined AA and BB'!$A$1:$C$6133,3,FALSE)","v":"Y"}]
[null,null,null,null,31529,2357.8875500729591,{"$f":"VLOOKUP(E1801,'[1]Combined AA and BB'!$A$1:$C$6133,3,FALSE)","v":"Y"}]
[null,null,null,null,31530,1170.9418746387137,{"$f":"VLOOKUP(E1802,'[1]Combined AA and BB'!$A$1:$C$6133,3,FALSE)","v":"Y"}]
[null,null,null,null,31531,2357.8875500729591,{"$f":"VLOOKUP(E1803,'[1]Combined AA and BB'!$A$1:$C$6133,3,FALSE)","v":"Y"}]
[null,null,null,null,31535,2357.8875500729591,{"$f":"VLOOKUP(E1804,'[1]Combined AA and BB'!$A$1:$C$6133,3,FALSE)","v":"Y"}]
[null,null,null,null,31536,2357.8875500729591,{"$f":"VLOOKUP(E1805,'[1]Combined AA and BB'!$A$1:$C$6133,3,FALSE)","v":"Y"}]
[null,null,null,null,31540,"Not covered","NA"]
[null,null,null,null,31541,"Not covered","NA"]
[null,null,null,null,31545,2357.8875500729591,{"$f":"VLOOKUP(E1808,'[1]Combined AA and BB'!$A$1:$C$6133,3,FALSE)","v":"Y"}]
[null,null,null,null,31546,3629.0737726136331,{"$f":"VLOOKUP(E1809,'[1]Combined AA and BB'!$A$1:$C$6133,3,FALSE)","v":"Y"}]
[null,null,null,null,31551,"Not covered","NA"]
[null,null,null,null,31552,4253.3690655926366,{"$f":"VLOOKUP(E1811,'[1]Combined AA and BB'!$A$1:$C$6133,3,FALSE)","v":"Y"}]
[null,null,null,null,31553,"Not covered","NA"]
[null,null,null,null,31554,4253.3690655926366,{"$f":"VLOOKUP(E1813,'[1]Combined AA and BB'!$A$1:$C$6133,3,FALSE)","v":"Y"}]
[null,null,null,null,31560,"Not covered","NA"]
[null,null,null,null,31561,"Not covered","NA"]
[null,null,null,null,31570,2357.8875500729591,{"$f":"VLOOKUP(E1816,'[1]Combined AA and BB'!$A$1:$C$6133,3,FALSE)","v":"Y"}]
[null,null,null,null,31571,2357.8875500729591,{"$f":"VLOOKUP(E1817,'[1]Combined AA and BB'!$A$1:$C$6133,3,FALSE)","v":"Y"}]
[null,null,null,null,31572,2357.8875500729591,{"$f":"VLOOKUP(E1818,'[1]Combined AA and BB'!$A$1:$C$6133,3,FALSE)","v":"Y"}]
[null,null,null,null,31573,541.21860000000004,{"$f":"VLOOKUP(E1819,'[1]Combined AA and BB'!$A$1:$C$6133,3,FALSE)","v":"Y"}]
[null,null,null,null,31574,1170.9418746387137,{"$f":"VLOOKUP(E1820,'[1]Combined AA and BB'!$A$1:$C$6133,3,FALSE)","v":"Y"}]
[null,null,null,null,31575,155.27147052919128,{"$f":"VLOOKUP(E1821,'[1]Combined AA and BB'!$A$1:$C$6133,3,FALSE)","v":"Y"}]
[null,null,null,null,31576,1170.9418746387137,{"$f":"VLOOKUP(E1822,'[1]Combined AA and BB'!$A$1:$C$6133,3,FALSE)","v":"Y"}]
[null,null,null,null,31577,327.60212763610645,{"$f":"VLOOKUP(E1823,'[1]Combined AA and BB'!$A$1:$C$6133,3,FALSE)","v":"Y"}]
[null,null,null,null,31578,2357.8875500729591,{"$f":"VLOOKUP(E1824,'[1]Combined AA and BB'!$A$1:$C$6133,3,FALSE)","v":"Y"}]
[null,null,null,null,31579,371.52960000000002,{"$f":"VLOOKUP(E1825,'[1]Combined AA and BB'!$A$1:$C$6133,3,FALSE)","v":"Y"}]
[null,null,null,null,31580,"Not covered","NA"]
[null,null,null,null,31590,4253.3690655926366,{"$f":"VLOOKUP(E1827,'[1]Combined AA and BB'!$A$1:$C$6133,3,FALSE)","v":"Y"}]
[null,null,null,null,31591,4253.3690655926366,{"$f":"VLOOKUP(E1828,'[1]Combined AA and BB'!$A$1:$C$6133,3,FALSE)","v":"Y"}]
[null,null,null,null,31592,4253.3690655926366,{"$f":"VLOOKUP(E1829,'[1]Combined AA and BB'!$A$1:$C$6133,3,FALSE)","v":"Y"}]
[null,null,null,null,31603,985.80817689537298,{"$f":"VLOOKUP(E1830,'[1]Combined AA and BB'!$A$1:$C$6133,3,FALSE)","v":"Y"}]
[null,null,null,null,31605,180.53152367673368,{"$f":"VLOOKUP(E1831,'[1]Combined AA and BB'!$A$1:$C$6133,3,FALSE)","v":"Y"}]
[null,null,null,null,31611,1916.5286762415849,{"$f":"VLOOKUP(E1832,'[1]Combined AA and BB'!$A$1:$C$6133,3,FALSE)","v":"Y"}]
[null,null,null,null,31612,1916.5286762415849,{"$f":"VLOOKUP(E1833,'[1]Combined AA and BB'!$A$1:$C$6133,3,FALSE)","v":"Y"}]
[null,null,null,null,31613,1916.5286762415849,{"$f":"VLOOKUP(E1834,'[1]Combined AA and BB'!$A$1:$C$6133,3,FALSE)","v":"Y"}]
[null,null,null,null,31614,4253.3690655926366,{"$f":"VLOOKUP(E1835,'[1]Combined AA and BB'!$A$1:$C$6133,3,FALSE)","v":"Y"}]
[null,null,null,null,31615,396.81640340099921,{"$f":"VLOOKUP(E1836,'[1]Combined AA and BB'!$A$1:$C$6133,3,FALSE)","v":"Y"}]
[null,null,null,null,31622,1170.9418746387137,{"$f":"VLOOKUP(E1837,'[1]Combined AA and BB'!$A$1:$C$6133,3,FALSE)","v":"Y"}]
[null,null,null,null,31623,1170.9418746387137,{"$f":"VLOOKUP(E1838,'[1]Combined AA and BB'!$A$1:$C$6133,3,FALSE)","v":"Y"}]
[null,null,null,null,31624,1170.9418746387137,{"$f":"VLOOKUP(E1839,'[1]Combined AA and BB'!$A$1:$C$6133,3,FALSE)","v":"Y"}]
[null,null,null,null,31625,1170.9418746387137,{"$f":"VLOOKUP(E1840,'[1]Combined AA and BB'!$A$1:$C$6133,3,FALSE)","v":"Y"}]
[null,null,null,null,31626,3629.0737726136331,{"$f":"VLOOKUP(E1841,'[1]Combined AA and BB'!$A$1:$C$6133,3,FALSE)","v":"Y"}]
[null,null,null,null,31627,"Bundled","NA"]
[null,null,null,null,31628,2357.8875500729591,{"$f":"VLOOKUP(E1843,'[1]Combined AA and BB'!$A$1:$C$6133,3,FALSE)","v":"Y"}]
[null,null,null,null,31629,2357.8875500729591,{"$f":"VLOOKUP(E1844,'[1]Combined AA and BB'!$A$1:$C$6133,3,FALSE)","v":"Y"}]
[null,null,null,null,31630,2357.8875500729591,{"$f":"VLOOKUP(E1845,'[1]Combined AA and BB'!$A$1:$C$6133,3,FALSE)","v":"Y"}]
[null,null,null,null,31631,3629.0737726136331,{"$f":"VLOOKUP(E1846,'[1]Combined AA and BB'!$A$1:$C$6133,3,FALSE)","v":"Y"}]
[null,null,null,null,31632,"Bundled","NA"]
[null,null,null,null,31633,"Bundled","NA"]
[null,null,null,null,31634,3629.0737726136331,{"$f":"VLOOKUP(E1849,'[1]Combined AA and BB'!$A$1:$C$6133,3,FALSE)","v":"Y"}]
[null,null,null,null,31635,1170.9418746387137,{"$f":"VLOOKUP(E1850,'[1]Combined AA and BB'!$A$1:$C$6133,3,FALSE)","v":"Y"}]
[null,null,null,null,31636,6755.3113113328036,{"$f":"VLOOKUP(E1851,'[1]Combined AA and BB'!$A$1:$C$6133,3,FALSE)","v":"Y"}]
[null,null,null,null,31637,"Bundled","NA"]
[null,null,null,null,31638,3629.0737726136331,{"$f":"VLOOKUP(E1853,'[1]Combined AA and BB'!$A$1:$C$6133,3,FALSE)","v":"Y"}]
[null,null,null,null,31640,2357.8875500729591,{"$f":"VLOOKUP(E1854,'[1]Combined AA and BB'!$A$1:$C$6133,3,FALSE)","v":"Y"}]
[null,null,null,null,31641,2357.8875500729591,{"$f":"VLOOKUP(E1855,'[1]Combined AA and BB'!$A$1:$C$6133,3,FALSE)","v":"Y"}]
[null,null,null,null,31643,1170.9418746387137,{"$f":"VLOOKUP(E1856,'[1]Combined AA and BB'!$A$1:$C$6133,3,FALSE)","v":"Y"}]
[null,null,null,null,31645,1170.9418746387137,{"$f":"VLOOKUP(E1857,'[1]Combined AA and BB'!$A$1:$C$6133,3,FALSE)","v":"Y"}]
[null,null,null,null,31646,327.60212763610645,{"$f":"VLOOKUP(E1858,'[1]Combined AA and BB'!$A$1:$C$6133,3,FALSE)","v":"Y"}]
[null,null,null,null,31647,6586.0876225510301,{"$f":"VLOOKUP(E1859,'[1]Combined AA and BB'!$A$1:$C$6133,3,FALSE)","v":"Y"}]
[null,null,null,null,31648,2357.8875500729591,{"$f":"VLOOKUP(E1860,'[1]Combined AA and BB'!$A$1:$C$6133,3,FALSE)","v":"Y"}]
[null,null,null,null,31649,1170.9418746387137,{"$f":"VLOOKUP(E1861,'[1]Combined AA and BB'!$A$1:$C$6133,3,FALSE)","v":"N"}]
[null,null,null,null,31651,"Bundled","NA"]
[null,null,null,null,31652,2357.8875500729591,{"$f":"VLOOKUP(E1863,'[1]Combined AA and BB'!$A$1:$C$6133,3,FALSE)","v":"Y"}]
[null,null,null,null,31653,2357.8875500729591,{"$f":"VLOOKUP(E1864,'[1]Combined AA and BB'!$A$1:$C$6133,3,FALSE)","v":"Y"}]
[null,null,null,null,31654,"Bundled","NA"]
[null,null,null,null,31717,327.60212763610645,{"$f":"VLOOKUP(E1866,'[1]Combined AA and BB'!$A$1:$C$6133,3,FALSE)","v":"Y"}]
[null,null,null,null,31720,"Bundled","NA"]
[null,null,null,null,31730,1170.9418746387137,{"$f":"VLOOKUP(E1868,'[1]Combined AA and BB'!$A$1:$C$6133,3,FALSE)","v":"Y"}]
[null,null,null,null,31750,4253.3690655926366,{"$f":"VLOOKUP(E1869,'[1]Combined AA and BB'!$A$1:$C$6133,3,FALSE)","v":"Y"}]
[null,null,null,null,31755,4253.3690655926366,{"$f":"VLOOKUP(E1870,'[1]Combined AA and BB'!$A$1:$C$6133,3,FALSE)","v":"Y"}]
[null,null,null,null,31820,1916.5286762415849,{"$f":"VLOOKUP(E1871,'[1]Combined AA and BB'!$A$1:$C$6133,3,FALSE)","v":"Y"}]
[null,null,null,null,31825,1916.5286762415849,{"$f":"VLOOKUP(E1872,'[1]Combined AA and BB'!$A$1:$C$6133,3,FALSE)","v":"Y"}]
[null,null,null,null,31830,1916.5286762415849,{"$f":"VLOOKUP(E1873,'[1]Combined AA and BB'!$A$1:$C$6133,3,FALSE)","v":"Y"}]
[null,null,null,null,32400,1062.8859418079082,{"$f":"VLOOKUP(E1874,'[1]Combined AA and BB'!$A$1:$C$6133,3,FALSE)","v":"Y"}]
[null,null,null,null,32408,1062.8859418079082,{"$f":"VLOOKUP(E1875,'[1]Combined AA and BB'!$A$1:$C$6133,3,FALSE)","v":"Y"}]
[null,null,null,null,32550,4868.24010045879,{"$f":"VLOOKUP(E1876,'[1]Combined AA and BB'!$A$1:$C$6133,3,FALSE)","v":"Y"}]
[null,null,null,null,32552,502.51934497970478,{"$f":"VLOOKUP(E1877,'[1]Combined AA and BB'!$A$1:$C$6133,3,FALSE)","v":"N"}]
[null,null,null,null,32554,502.51934497970478,{"$f":"VLOOKUP(E1878,'[1]Combined AA and BB'!$A$1:$C$6133,3,FALSE)","v":"Y"}]
[null,null,null,null,32555,502.51934497970478,{"$f":"VLOOKUP(E1879,'[1]Combined AA and BB'!$A$1:$C$6133,3,FALSE)","v":"Y"}]
[null,null,null,null,32556,1255.4159907297244,{"$f":"VLOOKUP(E1880,'[1]Combined AA and BB'!$A$1:$C$6133,3,FALSE)","v":"Y"}]
[null,null,null,null,32557,972.78886868062955,{"$f":"VLOOKUP(E1881,'[1]Combined AA and BB'!$A$1:$C$6133,3,FALSE)","v":"Y"}]
[null,null,null,null,32960,502.51934497970478,{"$f":"VLOOKUP(E1882,'[1]Combined AA and BB'!$A$1:$C$6133,3,FALSE)","v":"Y"}]
[null,null,null,null,32994,7724.144532180957,{"$f":"VLOOKUP(E1883,'[1]Combined AA and BB'!$A$1:$C$6133,3,FALSE)","v":"Y"}]
[null,null,null,null,32998,4168.5316199700519,{"$f":"VLOOKUP(E1884,'[1]Combined AA and BB'!$A$1:$C$6133,3,FALSE)","v":"Y"}]
[null,null,null,null,33016,972.78886868062955,{"$f":"VLOOKUP(E1885,'[1]Combined AA and BB'!$A$1:$C$6133,3,FALSE)","v":"Y"}]
[null,null,null,null,33206,16588.770447369825,{"$f":"VLOOKUP(E1886,'[1]Combined AA and BB'!$A$1:$C$6133,3,FALSE)","v":"Y"}]
[null,null,null,null,33207,16527.703312755293,{"$f":"VLOOKUP(E1887,'[1]Combined AA and BB'!$A$1:$C$6133,3,FALSE)","v":"Y"}]
[null,null,null,null,33208,16950.301543292786,{"$f":"VLOOKUP(E1888,'[1]Combined AA and BB'!$A$1:$C$6133,3,FALSE)","v":"Y"}]
[null,null,null,null,33210,6991.567477489366,{"$f":"VLOOKUP(E1889,'[1]Combined AA and BB'!$A$1:$C$6133,3,FALSE)","v":"Y"}]
[null,null,null,null,33211,13895.112229402646,{"$f":"VLOOKUP(E1890,'[1]Combined AA and BB'!$A$1:$C$6133,3,FALSE)","v":"Y"}]
[null,null,null,null,33212,14406.619199637084,{"$f":"VLOOKUP(E1891,'[1]Combined AA and BB'!$A$1:$C$6133,3,FALSE)","v":"Y"}]
[null,null,null,null,33213,16932.590366878958,{"$f":"VLOOKUP(E1892,'[1]Combined AA and BB'!$A$1:$C$6133,3,FALSE)","v":"Y"}]
[null,null,null,null,33214,16387.812337095915,{"$f":"VLOOKUP(E1893,'[1]Combined AA and BB'!$A$1:$C$6133,3,FALSE)","v":"Y"}]
[null,null,null,null,33215,2408.9180478528747,{"$f":"VLOOKUP(E1894,'[1]Combined AA and BB'!$A$1:$C$6133,3,FALSE)","v":"Y"}]
[null,null,null,null,33216,13073.682436934392,{"$f":"VLOOKUP(E1895,'[1]Combined AA and BB'!$A$1:$C$6133,3,FALSE)","v":"Y"}]
[null,null,null,null,33217,14194.89324046376,{"$f":"VLOOKUP(E1896,'[1]Combined AA and BB'!$A$1:$C$6133,3,FALSE)","v":"Y"}]
[null,null,null,null,33218,2910.8145422070238,{"$f":"VLOOKUP(E1897,'[1]Combined AA and BB'!$A$1:$C$6133,3,FALSE)","v":"Y"}]
[null,null,null,null,33220,5047.0592402154098,{"$f":"VLOOKUP(E1898,'[1]Combined AA and BB'!$A$1:$C$6133,3,FALSE)","v":"Y"}]
[null,null,null,null,33221,25420.865165778014,{"$f":"VLOOKUP(E1899,'[1]Combined AA and BB'!$A$1:$C$6133,3,FALSE)","v":"Y"}]
[null,null,null,null,33222,1499.1841543066416,{"$f":"VLOOKUP(E1900,'[1]Combined AA and BB'!$A$1:$C$6133,3,FALSE)","v":"Y"}]
[null,null,null,null,33223,1499.1841543066416,{"$f":"VLOOKUP(E1901,'[1]Combined AA and BB'!$A$1:$C$6133,3,FALSE)","v":"Y"}]
[null,null,null,null,33224,16956.231827940348,{"$f":"VLOOKUP(E1902,'[1]Combined AA and BB'!$A$1:$C$6133,3,FALSE)","v":"Y"}]
[null,null,null,null,33225,"Bundled","NA"]
[null,null,null,null,33226,4074.0941703709718,{"$f":"VLOOKUP(E1904,'[1]Combined AA and BB'!$A$1:$C$6133,3,FALSE)","v":"Y"}]
[null,null,null,null,33227,14069.560487576418,{"$f":"VLOOKUP(E1905,'[1]Combined AA and BB'!$A$1:$C$6133,3,FALSE)","v":"Y"}]
[null,null,null,null,33228,16567.098159521534,{"$f":"VLOOKUP(E1906,'[1]Combined AA and BB'!$A$1:$C$6133,3,FALSE)","v":"Y"}]
[null,null,null,null,33229,26012.778145130258,{"$f":"VLOOKUP(E1907,'[1]Combined AA and BB'!$A$1:$C$6133,3,FALSE)","v":"Y"}]
[null,null,null,null,33230,43282.472754086368,{"$f":"VLOOKUP(E1908,'[1]Combined AA and BB'!$A$1:$C$6133,3,FALSE)","v":"Y"}]
[null,null,null,null,33231,56683.311124495289,{"$f":"VLOOKUP(E1909,'[1]Combined AA and BB'!$A$1:$C$6133,3,FALSE)","v":"Y"}]
[null,null,null,null,33233,13167.67915597387,{"$f":"VLOOKUP(E1910,'[1]Combined AA and BB'!$A$1:$C$6133,3,FALSE)","v":"N"}]
[null,null,null,null,33234,5205.3671075441853,{"$f":"VLOOKUP(E1911,'[1]Combined AA and BB'!$A$1:$C$6133,3,FALSE)","v":"N"}]
[null,null,null,null,33235,4995.9290316993865,{"$f":"VLOOKUP(E1912,'[1]Combined AA and BB'!$A$1:$C$6133,3,FALSE)","v":"N"}]
[null,null,null,null,33240,44401.885121964457,{"$f":"VLOOKUP(E1913,'[1]Combined AA and BB'!$A$1:$C$6133,3,FALSE)","v":"Y"}]
[null,null,null,null,33241,2910.8145422070238,{"$f":"VLOOKUP(E1914,'[1]Combined AA and BB'!$A$1:$C$6133,3,FALSE)","v":"N"}]
[null,null,null,null,33249,56078.82047808823,{"$f":"VLOOKUP(E1915,'[1]Combined AA and BB'!$A$1:$C$6133,3,FALSE)","v":"Y"}]
[null,null,null,null,33262,42545.637732252813,{"$f":"VLOOKUP(E1916,'[1]Combined AA and BB'!$A$1:$C$6133,3,FALSE)","v":"Y"}]
[null,null,null,null,33263,42437.025877920692,{"$f":"VLOOKUP(E1917,'[1]Combined AA and BB'!$A$1:$C$6133,3,FALSE)","v":"Y"}]
[null,null,null,null,33264,56100.196820829355,{"$f":"VLOOKUP(E1918,'[1]Combined AA and BB'!$A$1:$C$6133,3,FALSE)","v":"Y"}]
[null,null,null,null,33270,55926.192480316342,{"$f":"VLOOKUP(E1919,'[1]Combined AA and BB'!$A$1:$C$6133,3,FALSE)","v":"Y"}]
[null,null,null,null,33271,13685.105028351745,{"$f":"VLOOKUP(E1920,'[1]Combined AA and BB'!$A$1:$C$6133,3,FALSE)","v":"Y"}]
[null,null,null,null,33273,2910.8145422070238,{"$f":"VLOOKUP(E1921,'[1]Combined AA and BB'!$A$1:$C$6133,3,FALSE)","v":"Y"}]
[null,null,null,null,33274,27418.528786701383,{"$f":"VLOOKUP(E1922,'[1]Combined AA and BB'!$A$1:$C$6133,3,FALSE)","v":"Y"}]
[null,null,null,null,33275,5469.0655805385613,{"$f":"VLOOKUP(E1923,'[1]Combined AA and BB'!$A$1:$C$6133,3,FALSE)","v":"Y"}]
[null,null,null,null,33285,15470.211767300885,{"$f":"VLOOKUP(E1924,'[1]Combined AA and BB'!$A$1:$C$6133,3,FALSE)","v":"Y"}]
[null,null,null,null,33286,563.74037104996432,{"$f":"VLOOKUP(E1925,'[1]Combined AA and BB'!$A$1:$C$6133,3,FALSE)","v":"N"}]
[null,null,null,null,33419,"Bundled","NA"]
[null,null,null,null,33508,"Bundled","NA"]
[null,null,null,null,33866,"Not covered","NA"]
[null,null,null,null,33900,12920.610521501738,{"$f":"VLOOKUP(E1929,'[1]Combined AA and BB'!$A$1:$C$6133,3,FALSE)","v":"Y"}]
[null,null,null,null,33901,12920.610521501738,{"$f":"VLOOKUP(E1930,'[1]Combined AA and BB'!$A$1:$C$6133,3,FALSE)","v":"Y"}]
[null,null,null,null,33902,21472.092365790264,{"$f":"VLOOKUP(E1931,'[1]Combined AA and BB'!$A$1:$C$6133,3,FALSE)","v":"Y"}]
[null,null,null,null,33903,12920.610521501738,{"$f":"VLOOKUP(E1932,'[1]Combined AA and BB'!$A$1:$C$6133,3,FALSE)","v":"Y"}]
[null,null,null,null,34713,"Bundled","NA"]
[null,null,null,null,34714,"Bundled","NA"]
[null,null,null,null,34715,"Bundled","NA"]
[null,null,null,null,34716,"Bundled","NA"]
[null,null,null,null,35188,4406.1577843227369,{"$f":"VLOOKUP(E1937,'[1]Combined AA and BB'!$A$1:$C$6133,3,FALSE)","v":"Y"}]
[null,null,null,null,35207,2408.9180478528747,{"$f":"VLOOKUP(E1938,'[1]Combined AA and BB'!$A$1:$C$6133,3,FALSE)","v":"Y"}]
[null,null,null,null,35572,"Bundled","NA"]
[null,null,null,null,35875,4406.1577843227369,{"$f":"VLOOKUP(E1940,'[1]Combined AA and BB'!$A$1:$C$6133,3,FALSE)","v":"Y"}]
[null,null,null,null,35876,4406.1577843227369,{"$f":"VLOOKUP(E1941,'[1]Combined AA and BB'!$A$1:$C$6133,3,FALSE)","v":"Y"}]
[null,null,null,null,36000,"Bundled","NA"]
[null,null,null,null,36002,502.51934497970478,{"$f":"VLOOKUP(E1943,'[1]Combined AA and BB'!$A$1:$C$6133,3,FALSE)","v":"Y"}]
[null,null,null,null,36005,"Bundled","NA"]
[null,null,null,null,36010,"Bundled","NA"]
[null,null,null,null,36011,"Bundled","NA"]
[null,null,null,null,36012,"Bundled","NA"]
[null,null,null,null,36013,"Bundled","NA"]
[null,null,null,null,36014,"Bundled","NA"]
[null,null,null,null,36015,"Bundled","NA"]
[null,null,null,null,36100,"Bundled","NA"]
[null,null,null,null,36140,"Bundled","NA"]
[null,null,null,null,36160,"Bundled","NA"]
[null,null,null,null,36200,"Bundled","NA"]
[null,null,null,null,36215,"Bundled","NA"]
[null,null,null,null,36216,"Bundled","NA"]
[null,null,null,null,36217,"Bundled","NA"]
[null,null,null,null,36218,"Bundled","NA"]
[null,null,null,null,36221,"Bundled","NA"]
[null,null,null,null,36222,"Bundled","NA"]
[null,null,null,null,36223,"Bundled","NA"]
[null,null,null,null,36224,"Bundled","NA"]
[null,null,null,null,36225,"Bundled","NA"]
[null,null,null,null,36226,"Bundled","NA"]
[null,null,null,null,36227,"Bundled","NA"]
[null,null,null,null,36228,"Bundled","NA"]
[null,null,null,null,36245,"Bundled","NA"]
[null,null,null,null,36246,"Bundled","NA"]
[null,null,null,null,36247,"Bundled","NA"]
[null,null,null,null,36248,"Bundled","NA"]
[null,null,null,null,36251,"Bundled","NA"]
[null,null,null,null,36252,"Bundled","NA"]
[null,null,null,null,36253,"Bundled","NA"]
[null,null,null,null,36254,"Bundled","NA"]
[null,null,null,null,36260,"Not covered","NA"]
[null,null,null,null,36261,"Not covered","NA"]
[null,null,null,null,36262,"Not covered","NA"]
[null,null,null,null,36400,"Not covered","NA"]
[null,null,null,null,36405,"Not covered","NA"]
[null,null,null,null,36406,"Not covered","NA"]
[null,null,null,null,36410,"Bundled","NA"]
[null,null,null,null,36416,"Bundled","NA"]
[null,null,null,null,36420,"Not covered","NA"]
[null,null,null,null,36425,"Bundled","NA"]
[null,null,null,null,36430,75.020399999999995,{"$f":"VLOOKUP(E1985,'[1]Combined AA and BB'!$A$1:$C$6133,3,FALSE)","v":"N"}]
[null,null,null,null,36440,"Not covered","NA"]
[null,null,null,null,36450,"Not covered","NA"]
[null,null,null,null,36465,1499.1841543066416,{"$f":"VLOOKUP(E1988,'[1]Combined AA and BB'!$A$1:$C$6133,3,FALSE)","v":"Y"}]
[null,null,null,null,36466,1499.1841543066416,{"$f":"VLOOKUP(E1989,'[1]Combined AA and BB'!$A$1:$C$6133,3,FALSE)","v":"Y"}]
[null,null,null,null,36468,"Not covered","NA"]
[null,null,null,null,36470,"Not covered","NA"]
[null,null,null,null,36471,"Not covered","NA"]
[null,null,null,null,36473,2325.0369999999998,{"$f":"VLOOKUP(E1993,'[1]Combined AA and BB'!$A$1:$C$6133,3,FALSE)","v":"Y"}]
[null,null,null,null,36474,"Bundled","NA"]
[null,null,null,null,36475,2408.9180478528747,{"$f":"VLOOKUP(E1995,'[1]Combined AA and BB'!$A$1:$C$6133,3,FALSE)","v":"Y"}]
[null,null,null,null,36476,"Bundled","NA"]
[null,null,null,null,36478,2408.9180478528747,{"$f":"VLOOKUP(E1997,'[1]Combined AA and BB'!$A$1:$C$6133,3,FALSE)","v":"Y"}]
[null,null,null,null,36479,"Bundled","NA"]
[null,null,null,null,36481,"Bundled","NA"]
[null,null,null,null,36482,3208.0152000000003,{"$f":"VLOOKUP(E2000,'[1]Combined AA and BB'!$A$1:$C$6133,3,FALSE)","v":"Y"}]
[null,null,null,null,36483,"Bundled","NA"]
[null,null,null,null,36500,"Bundled","NA"]
[null,null,null,null,36510,"Not covered","NA"]
[null,null,null,null,36511,"Not covered","NA"]
[null,null,null,null,36512,"Not covered","NA"]
[null,null,null,null,36513,"Not covered","NA"]
[null,null,null,null,36514,"Not covered","NA"]
[null,null,null,null,36516,"Not covered","NA"]
[null,null,null,null,36522,"Not covered","NA"]
[null,null,null,null,36555,"Not covered","NA"]
[null,null,null,null,36556,2408.9180478528747,{"$f":"VLOOKUP(E2011,'[1]Combined AA and BB'!$A$1:$C$6133,3,FALSE)","v":"Y"}]
[null,null,null,null,36557,"Not covered","NA"]
[null,null,null,null,36558,2408.9180478528747,{"$f":"VLOOKUP(E2013,'[1]Combined AA and BB'!$A$1:$C$6133,3,FALSE)","v":"Y"}]
[null,null,null,null,36560,"Not covered","NA"]
[null,null,null,null,36561,2408.9180478528747,{"$f":"VLOOKUP(E2015,'[1]Combined AA and BB'!$A$1:$C$6133,3,FALSE)","v":"Y"}]
[null,null,null,null,36563,10059.561197916428,{"$f":"VLOOKUP(E2016,'[1]Combined AA and BB'!$A$1:$C$6133,3,FALSE)","v":"Y"}]
[null,null,null,null,36565,2408.9180478528747,{"$f":"VLOOKUP(E2017,'[1]Combined AA and BB'!$A$1:$C$6133,3,FALSE)","v":"Y"}]
[null,null,null,null,36566,4406.1577843227369,{"$f":"VLOOKUP(E2018,'[1]Combined AA and BB'!$A$1:$C$6133,3,FALSE)","v":"Y"}]
[null,null,null,null,36568,"Not covered","NA"]
[null,null,null,null,36569,972.78886868062955,{"$f":"VLOOKUP(E2020,'[1]Combined AA and BB'!$A$1:$C$6133,3,FALSE)","v":"Y"}]
[null,null,null,null,36570,"Not covered","NA"]
[null,null,null,null,36571,2408.9180478528747,{"$f":"VLOOKUP(E2022,'[1]Combined AA and BB'!$A$1:$C$6133,3,FALSE)","v":"Y"}]
[null,null,null,null,36572,"Not covered","NA"]
[null,null,null,null,36573,972.78886868062955,{"$f":"VLOOKUP(E2024,'[1]Combined AA and BB'!$A$1:$C$6133,3,FALSE)","v":"Y"}]
[null,null,null,null,36575,502.51934497970478,{"$f":"VLOOKUP(E2025,'[1]Combined AA and BB'!$A$1:$C$6133,3,FALSE)","v":"Y"}]
[null,null,null,null,36576,972.78886868062955,{"$f":"VLOOKUP(E2026,'[1]Combined AA and BB'!$A$1:$C$6133,3,FALSE)","v":"Y"}]
[null,null,null,null,36578,2408.9180478528747,{"$f":"VLOOKUP(E2027,'[1]Combined AA and BB'!$A$1:$C$6133,3,FALSE)","v":"Y"}]
[null,null,null,null,36580,1643.474240159092,{"$f":"VLOOKUP(E2028,'[1]Combined AA and BB'!$A$1:$C$6133,3,FALSE)","v":"Y"}]
[null,null,null,null,36581,4112.0320566095979,{"$f":"VLOOKUP(E2029,'[1]Combined AA and BB'!$A$1:$C$6133,3,FALSE)","v":"Y"}]
[null,null,null,null,36582,2408.9180478528747,{"$f":"VLOOKUP(E2030,'[1]Combined AA and BB'!$A$1:$C$6133,3,FALSE)","v":"Y"}]
[null,null,null,null,36583,10152.954644237438,{"$f":"VLOOKUP(E2031,'[1]Combined AA and BB'!$A$1:$C$6133,3,FALSE)","v":"Y"}]
[null,null,null,null,36584,972.78886868062955,{"$f":"VLOOKUP(E2032,'[1]Combined AA and BB'!$A$1:$C$6133,3,FALSE)","v":"Y"}]
[null,null,null,null,36585,2408.9180478528747,{"$f":"VLOOKUP(E2033,'[1]Combined AA and BB'!$A$1:$C$6133,3,FALSE)","v":"Y"}]
[null,null,null,null,36589,502.51934497970478,{"$f":"VLOOKUP(E2034,'[1]Combined AA and BB'!$A$1:$C$6133,3,FALSE)","v":"N"}]
[null,null,null,null,36590,972.78886868062955,{"$f":"VLOOKUP(E2035,'[1]Combined AA and BB'!$A$1:$C$6133,3,FALSE)","v":"N"}]
[null,null,null,null,36591,"Bundled","NA"]
[null,null,null,null,36592,"Bundled","NA"]
[null,null,null,null,36593,63.112400000000001,{"$f":"VLOOKUP(E2038,'[1]Combined AA and BB'!$A$1:$C$6133,3,FALSE)","v":"Y"}]
[null,null,null,null,36595,1122.9243999999999,{"$f":"VLOOKUP(E2039,'[1]Combined AA and BB'!$A$1:$C$6133,3,FALSE)","v":"Y"}]
[null,null,null,null,36596,972.78886868062955,{"$f":"VLOOKUP(E2040,'[1]Combined AA and BB'!$A$1:$C$6133,3,FALSE)","v":"Y"}]
[null,null,null,null,36597,972.78886868062955,{"$f":"VLOOKUP(E2041,'[1]Combined AA and BB'!$A$1:$C$6133,3,FALSE)","v":"Y"}]
[null,null,null,null,36598,228.6336,{"$f":"VLOOKUP(E2042,'[1]Combined AA and BB'!$A$1:$C$6133,3,FALSE)","v":"Y"}]
[null,null,null,null,36600,"Bundled","NA"]
[null,null,null,null,36620,"Bundled","NA"]
[null,null,null,null,36625,"Bundled","NA"]
[null,null,null,null,36640,"Not covered","NA"]
[null,null,null,null,36680,"Not covered","NA"]
[null,null,null,null,36800,4406.1577843227369,{"$f":"VLOOKUP(E2048,'[1]Combined AA and BB'!$A$1:$C$6133,3,FALSE)","v":"Y"}]
[null,null,null,null,36810,2408.9180478528747,{"$f":"VLOOKUP(E2049,'[1]Combined AA and BB'!$A$1:$C$6133,3,FALSE)","v":"Y"}]
[null,null,null,null,36815,4406.1577843227369,{"$f":"VLOOKUP(E2050,'[1]Combined AA and BB'!$A$1:$C$6133,3,FALSE)","v":"Y"}]
[null,null,null,null,36818,4406.1577843227369,{"$f":"VLOOKUP(E2051,'[1]Combined AA and BB'!$A$1:$C$6133,3,FALSE)","v":"Y"}]
[null,null,null,null,36819,4406.1577843227369,{"$f":"VLOOKUP(E2052,'[1]Combined AA and BB'!$A$1:$C$6133,3,FALSE)","v":"Y"}]
[null,null,null,null,36820,4406.1577843227369,{"$f":"VLOOKUP(E2053,'[1]Combined AA and BB'!$A$1:$C$6133,3,FALSE)","v":"Y"}]
[null,null,null,null,36821,2408.9180478528747,{"$f":"VLOOKUP(E2054,'[1]Combined AA and BB'!$A$1:$C$6133,3,FALSE)","v":"Y"}]
[null,null,null,null,36825,4406.1577843227369,{"$f":"VLOOKUP(E2055,'[1]Combined AA and BB'!$A$1:$C$6133,3,FALSE)","v":"Y"}]
[null,null,null,null,36830,4406.1577843227369,{"$f":"VLOOKUP(E2056,'[1]Combined AA and BB'!$A$1:$C$6133,3,FALSE)","v":"Y"}]
[null,null,null,null,36831,4406.1577843227369,{"$f":"VLOOKUP(E2057,'[1]Combined AA and BB'!$A$1:$C$6133,3,FALSE)","v":"Y"}]
[null,null,null,null,36832,4406.1577843227369,{"$f":"VLOOKUP(E2058,'[1]Combined AA and BB'!$A$1:$C$6133,3,FALSE)","v":"Y"}]
[null,null,null,null,36833,4406.1577843227369,{"$f":"VLOOKUP(E2059,'[1]Combined AA and BB'!$A$1:$C$6133,3,FALSE)","v":"Y"}]
[null,null,null,null,36835,"Not covered","NA"]
[null,null,null,null,36836,22723.780814070116,{"$f":"VLOOKUP(E2061,'[1]Combined AA and BB'!$A$1:$C$6133,3,FALSE)","v":"Y"}]
[null,null,null,null,36837,25139.603488923392,{"$f":"VLOOKUP(E2062,'[1]Combined AA and BB'!$A$1:$C$6133,3,FALSE)","v":"Y"}]
[null,null,null,null,36860,972.78886868062955,{"$f":"VLOOKUP(E2063,'[1]Combined AA and BB'!$A$1:$C$6133,3,FALSE)","v":"Y"}]
[null,null,null,null,36861,7717.2239696747802,{"$f":"VLOOKUP(E2064,'[1]Combined AA and BB'!$A$1:$C$6133,3,FALSE)","v":"Y"}]
[null,null,null,null,36901,1340.2454,{"$f":"VLOOKUP(E2065,'[1]Combined AA and BB'!$A$1:$C$6133,3,FALSE)","v":"Y"}]
[null,null,null,null,36902,3882.2019969801527,{"$f":"VLOOKUP(E2066,'[1]Combined AA and BB'!$A$1:$C$6133,3,FALSE)","v":"Y"}]
[null,null,null,null,36903,15004.428316124522,{"$f":"VLOOKUP(E2067,'[1]Combined AA and BB'!$A$1:$C$6133,3,FALSE)","v":"Y"}]
[null,null,null,null,36904,6740.2977883958856,{"$f":"VLOOKUP(E2068,'[1]Combined AA and BB'!$A$1:$C$6133,3,FALSE)","v":"Y"}]
[null,null,null,null,36905,12966.89178326179,{"$f":"VLOOKUP(E2069,'[1]Combined AA and BB'!$A$1:$C$6133,3,FALSE)","v":"Y"}]
[null,null,null,null,36906,24684.428531588739,{"$f":"VLOOKUP(E2070,'[1]Combined AA and BB'!$A$1:$C$6133,3,FALSE)","v":"Y"}]
[null,null,null,null,36907,"Bundled","NA"]
[null,null,null,null,36908,"Bundled","NA"]
[null,null,null,null,36909,"Bundled","NA"]
[null,null,null,null,37184,14406.676112157693,{"$f":"VLOOKUP(E2074,'[1]Combined AA and BB'!$A$1:$C$6133,3,FALSE)","v":"Y"}]
[null,null,null,null,37185,"Bundled","NA"]
[null,null,null,null,37186,"Bundled","NA"]
[null,null,null,null,37187,16071.344574991947,{"$f":"VLOOKUP(E2077,'[1]Combined AA and BB'!$A$1:$C$6133,3,FALSE)","v":"Y"}]
[null,null,null,null,37188,5462.0881055117743,{"$f":"VLOOKUP(E2078,'[1]Combined AA and BB'!$A$1:$C$6133,3,FALSE)","v":"Y"}]
[null,null,null,null,37197,2408.9180478528747,{"$f":"VLOOKUP(E2079,'[1]Combined AA and BB'!$A$1:$C$6133,3,FALSE)","v":"Y"}]
[null,null,null,null,37200,4406.1577843227369,{"$f":"VLOOKUP(E2080,'[1]Combined AA and BB'!$A$1:$C$6133,3,FALSE)","v":"Y"}]
[null,null,null,null,37211,7451.9888586239358,{"$f":"VLOOKUP(E2081,'[1]Combined AA and BB'!$A$1:$C$6133,3,FALSE)","v":"Y"}]
[null,null,null,null,37212,2408.9180478528747,{"$f":"VLOOKUP(E2082,'[1]Combined AA and BB'!$A$1:$C$6133,3,FALSE)","v":"Y"}]
[null,null,null,null,37220,6747.821623620528,{"$f":"VLOOKUP(E2083,'[1]Combined AA and BB'!$A$1:$C$6133,3,FALSE)","v":"Y"}]
[null,null,null,null,37221,14485.329215640713,{"$f":"VLOOKUP(E2084,'[1]Combined AA and BB'!$A$1:$C$6133,3,FALSE)","v":"Y"}]
[null,null,null,null,37222,"Bundled","NA"]
[null,null,null,null,37223,"Bundled","NA"]
[null,null,null,null,37236,14017.132673590488,{"$f":"VLOOKUP(E2087,'[1]Combined AA and BB'!$A$1:$C$6133,3,FALSE)","v":"Y"}]
[null,null,null,null,37237,"Bundled","NA"]
[null,null,null,null,37238,14178.126811892053,{"$f":"VLOOKUP(E2089,'[1]Combined AA and BB'!$A$1:$C$6133,3,FALSE)","v":"Y"}]
[null,null,null,null,37239,"Bundled","NA"]
[null,null,null,null,37246,6666.4708666605948,{"$f":"VLOOKUP(E2091,'[1]Combined AA and BB'!$A$1:$C$6133,3,FALSE)","v":"Y"}]
[null,null,null,null,37247,"Bundled","NA"]
[null,null,null,null,37248,3882.2019969801527,{"$f":"VLOOKUP(E2093,'[1]Combined AA and BB'!$A$1:$C$6133,3,FALSE)","v":"Y"}]
[null,null,null,null,37249,"Bundled","NA"]
[null,null,null,null,37252,"Bundled","NA"]
[null,null,null,null,37253,"Bundled","NA"]
[null,null,null,null,37500,4406.1577843227369,{"$f":"VLOOKUP(E2097,'[1]Combined AA and BB'!$A$1:$C$6133,3,FALSE)","v":"Y"}]
[null,null,null,null,37607,2408.9180478528747,{"$f":"VLOOKUP(E2098,'[1]Combined AA and BB'!$A$1:$C$6133,3,FALSE)","v":"Y"}]
[null,null,null,null,37609,1062.8859418079082,{"$f":"VLOOKUP(E2099,'[1]Combined AA and BB'!$A$1:$C$6133,3,FALSE)","v":"Y"}]
[null,null,null,null,37650,2408.9180478528747,{"$f":"VLOOKUP(E2100,'[1]Combined AA and BB'!$A$1:$C$6133,3,FALSE)","v":"Y"}]
[null,null,null,null,37700,2408.9180478528747,{"$f":"VLOOKUP(E2101,'[1]Combined AA and BB'!$A$1:$C$6133,3,FALSE)","v":"Y"}]
[null,null,null,null,37718,"Not covered","NA"]
[null,null,null,null,37722,"Not covered","NA"]
[null,null,null,null,37735,2408.9180478528747,{"$f":"VLOOKUP(E2104,'[1]Combined AA and BB'!$A$1:$C$6133,3,FALSE)","v":"Y"}]
[null,null,null,null,37760,2408.9180478528747,{"$f":"VLOOKUP(E2105,'[1]Combined AA and BB'!$A$1:$C$6133,3,FALSE)","v":"Y"}]
[null,null,null,null,37761,2408.9180478528747,{"$f":"VLOOKUP(E2106,'[1]Combined AA and BB'!$A$1:$C$6133,3,FALSE)","v":"Y"}]
[null,null,null,null,37765,774.61540000000002,{"$f":"VLOOKUP(E2107,'[1]Combined AA and BB'!$A$1:$C$6133,3,FALSE)","v":"Y"}]
[null,null,null,null,37766,907.38959999999997,{"$f":"VLOOKUP(E2108,'[1]Combined AA and BB'!$A$1:$C$6133,3,FALSE)","v":"Y"}]
[null,null,null,null,37780,2408.9180478528747,{"$f":"VLOOKUP(E2109,'[1]Combined AA and BB'!$A$1:$C$6133,3,FALSE)","v":"Y"}]
[null,null,null,null,37785,2408.9180478528747,{"$f":"VLOOKUP(E2110,'[1]Combined AA and BB'!$A$1:$C$6133,3,FALSE)","v":"Y"}]
[null,null,null,null,37790,"Not covered","NA"]
[null,null,null,null,38200,"Bundled","NA"]
[null,null,null,null,38204,"Not covered","NA"]
[null,null,null,null,38206,"Not covered","NA"]
[null,null,null,null,38220,291.1506,{"$f":"VLOOKUP(E2115,'[1]Combined AA and BB'!$A$1:$C$6133,3,FALSE)","v":"Y"}]
[null,null,null,null,38221,302.46319999999997,{"$f":"VLOOKUP(E2116,'[1]Combined AA and BB'!$A$1:$C$6133,3,FALSE)","v":"Y"}]
[null,null,null,null,38222,1789.2422303467429,{"$f":"VLOOKUP(E2117,'[1]Combined AA and BB'!$A$1:$C$6133,3,FALSE)","v":"Y"}]
[null,null,null,null,38230,1181.2362113666504,{"$f":"VLOOKUP(E2118,'[1]Combined AA and BB'!$A$1:$C$6133,3,FALSE)","v":"N"}]
[null,null,null,null,38232,"Not covered","NA"]
[null,null,null,null,38241,"Not covered","NA"]
[null,null,null,null,38242,"Not covered","NA"]
[null,null,null,null,38243,1181.2362113666504,{"$f":"VLOOKUP(E2122,'[1]Combined AA and BB'!$A$1:$C$6133,3,FALSE)","v":"N"}]
[null,null,null,null,38300,1789.2422303467429,{"$f":"VLOOKUP(E2123,'[1]Combined AA and BB'!$A$1:$C$6133,3,FALSE)","v":"Y"}]
[null,null,null,null,38305,1789.2422303467429,{"$f":"VLOOKUP(E2124,'[1]Combined AA and BB'!$A$1:$C$6133,3,FALSE)","v":"Y"}]
[null,null,null,null,38308,"Not covered","NA"]
[null,null,null,null,38500,2166.8367713868383,{"$f":"VLOOKUP(E2126,'[1]Combined AA and BB'!$A$1:$C$6133,3,FALSE)","v":"Y"}]
[null,null,null,null,38505,1062.8859418079082,{"$f":"VLOOKUP(E2127,'[1]Combined AA and BB'!$A$1:$C$6133,3,FALSE)","v":"Y"}]
[null,null,null,null,38510,2166.8367713868383,{"$f":"VLOOKUP(E2128,'[1]Combined AA and BB'!$A$1:$C$6133,3,FALSE)","v":"Y"}]
[null,null,null,null,38520,2166.8367713868383,{"$f":"VLOOKUP(E2129,'[1]Combined AA and BB'!$A$1:$C$6133,3,FALSE)","v":"Y"}]
[null,null,null,null,38525,2166.8367713868383,{"$f":"VLOOKUP(E2130,'[1]Combined AA and BB'!$A$1:$C$6133,3,FALSE)","v":"Y"}]
[null,null,null,null,38530,2166.8367713868383,{"$f":"VLOOKUP(E2131,'[1]Combined AA and BB'!$A$1:$C$6133,3,FALSE)","v":"Y"}]
[null,null,null,null,38542,4168.5316199700519,{"$f":"VLOOKUP(E2132,'[1]Combined AA and BB'!$A$1:$C$6133,3,FALSE)","v":"Y"}]
[null,null,null,null,38550,2166.8367713868383,{"$f":"VLOOKUP(E2133,'[1]Combined AA and BB'!$A$1:$C$6133,3,FALSE)","v":"Y"}]
[null,null,null,null,38555,4019.3242923368975,{"$f":"VLOOKUP(E2134,'[1]Combined AA and BB'!$A$1:$C$6133,3,FALSE)","v":"Y"}]
[null,null,null,null,38570,4168.5316199700519,{"$f":"VLOOKUP(E2135,'[1]Combined AA and BB'!$A$1:$C$6133,3,FALSE)","v":"Y"}]
[null,null,null,null,38571,7140.4028248878139,{"$f":"VLOOKUP(E2136,'[1]Combined AA and BB'!$A$1:$C$6133,3,FALSE)","v":"Y"}]
[null,null,null,null,38572,7140.4028248878139,{"$f":"VLOOKUP(E2137,'[1]Combined AA and BB'!$A$1:$C$6133,3,FALSE)","v":"Y"}]
[null,null,null,null,38573,7140.4028248878139,{"$f":"VLOOKUP(E2138,'[1]Combined AA and BB'!$A$1:$C$6133,3,FALSE)","v":"Y"}]
[null,null,null,null,38700,4019.3242923368975,{"$f":"VLOOKUP(E2139,'[1]Combined AA and BB'!$A$1:$C$6133,3,FALSE)","v":"Y"}]
[null,null,null,null,38740,4168.5316199700519,{"$f":"VLOOKUP(E2140,'[1]Combined AA and BB'!$A$1:$C$6133,3,FALSE)","v":"Y"}]
[null,null,null,null,38745,4168.5316199700519,{"$f":"VLOOKUP(E2141,'[1]Combined AA and BB'!$A$1:$C$6133,3,FALSE)","v":"Y"}]
[null,null,null,null,38760,4019.3242923368975,{"$f":"VLOOKUP(E2142,'[1]Combined AA and BB'!$A$1:$C$6133,3,FALSE)","v":"Y"}]
[null,null,null,null,38790,"Bundled","NA"]
[null,null,null,null,38792,"Bundled","NA"]
[null,null,null,null,38794,"Not covered","NA"]
[null,null,null,null,38900,"Not covered","NA"]
[null,null,null,null,40490,"Not covered","NA"]
[null,null,null,null,40500,"Not covered","NA"]
[null,null,null,null,40510,1916.5286762415849,{"$f":"VLOOKUP(E2149,'[1]Combined AA and BB'!$A$1:$C$6133,3,FALSE)","v":"Y"}]
[null,null,null,null,40520,1916.5286762415849,{"$f":"VLOOKUP(E2150,'[1]Combined AA and BB'!$A$1:$C$6133,3,FALSE)","v":"Y"}]
[null,null,null,null,40525,1916.5286762415849,{"$f":"VLOOKUP(E2151,'[1]Combined AA and BB'!$A$1:$C$6133,3,FALSE)","v":"Y"}]
[null,null,null,null,40527,4253.3690655926366,{"$f":"VLOOKUP(E2152,'[1]Combined AA and BB'!$A$1:$C$6133,3,FALSE)","v":"Y"}]
[null,null,null,null,40530,1916.5286762415849,{"$f":"VLOOKUP(E2153,'[1]Combined AA and BB'!$A$1:$C$6133,3,FALSE)","v":"Y"}]
[null,null,null,null,40650,396.81640340099921,{"$f":"VLOOKUP(E2154,'[1]Combined AA and BB'!$A$1:$C$6133,3,FALSE)","v":"Y"}]
[null,null,null,null,40652,396.81640340099921,{"$f":"VLOOKUP(E2155,'[1]Combined AA and BB'!$A$1:$C$6133,3,FALSE)","v":"Y"}]
[null,null,null,null,40654,985.80817689537298,{"$f":"VLOOKUP(E2156,'[1]Combined AA and BB'!$A$1:$C$6133,3,FALSE)","v":"Y"}]
[null,null,null,null,40700,"Not covered","NA"]
[null,null,null,null,40701,"Not covered","NA"]
[null,null,null,null,40702,"Not covered","NA"]
[null,null,null,null,40720,"Not covered","NA"]
[null,null,null,null,40761,"Not covered","NA"]
[null,null,null,null,40800,383.43760000000003,{"$f":"VLOOKUP(E2162,'[1]Combined AA and BB'!$A$1:$C$6133,3,FALSE)","v":"Y"}]
[null,null,null,null,40801,396.81640340099921,{"$f":"VLOOKUP(E2163,'[1]Combined AA and BB'!$A$1:$C$6133,3,FALSE)","v":"Y"}]
[null,null,null,null,40804,"Bundled","NA"]
[null,null,null,null,40805,531.69219999999996,{"$f":"VLOOKUP(E2165,'[1]Combined AA and BB'!$A$1:$C$6133,3,FALSE)","v":"Y"}]
[null,null,null,null,40806,189.93260000000001,{"$f":"VLOOKUP(E2166,'[1]Combined AA and BB'!$A$1:$C$6133,3,FALSE)","v":"Y"}]
[null,null,null,null,40808,"Not covered","NA"]
[null,null,null,null,40810,"Not covered","NA"]
[null,null,null,null,40812,"Not covered","NA"]
[null,null,null,null,40814,"Not covered","NA"]
[null,null,null,null,40816,"Not covered","NA"]
[null,null,null,null,40818,"Not covered","NA"]
[null,null,null,null,40819,985.80817689537298,{"$f":"VLOOKUP(E2173,'[1]Combined AA and BB'!$A$1:$C$6133,3,FALSE)","v":"Y"}]
[null,null,null,null,40820,492.39579999999995,{"$f":"VLOOKUP(E2174,'[1]Combined AA and BB'!$A$1:$C$6133,3,FALSE)","v":"Y"}]
[null,null,null,null,40830,180.53152367673368,{"$f":"VLOOKUP(E2175,'[1]Combined AA and BB'!$A$1:$C$6133,3,FALSE)","v":"Y"}]
[null,null,null,null,40831,396.81640340099921,{"$f":"VLOOKUP(E2176,'[1]Combined AA and BB'!$A$1:$C$6133,3,FALSE)","v":"Y"}]
[null,null,null,null,40840,4253.3690655926366,{"$f":"VLOOKUP(E2177,'[1]Combined AA and BB'!$A$1:$C$6133,3,FALSE)","v":"Y"}]
[null,null,null,null,40842,4253.3690655926366,{"$f":"VLOOKUP(E2178,'[1]Combined AA and BB'!$A$1:$C$6133,3,FALSE)","v":"Y"}]
[null,null,null,null,40843,4253.3690655926366,{"$f":"VLOOKUP(E2179,'[1]Combined AA and BB'!$A$1:$C$6133,3,FALSE)","v":"Y"}]
[null,null,null,null,40844,4253.3690655926366,{"$f":"VLOOKUP(E2180,'[1]Combined AA and BB'!$A$1:$C$6133,3,FALSE)","v":"Y"}]
[null,null,null,null,40845,4253.3690655926366,{"$f":"VLOOKUP(E2181,'[1]Combined AA and BB'!$A$1:$C$6133,3,FALSE)","v":"Y"}]
[null,null,null,null,41000,276.86099999999999,{"$f":"VLOOKUP(E2182,'[1]Combined AA and BB'!$A$1:$C$6133,3,FALSE)","v":"Y"}]
[null,null,null,null,41005,180.53152367673368,{"$f":"VLOOKUP(E2183,'[1]Combined AA and BB'!$A$1:$C$6133,3,FALSE)","v":"Y"}]
[null,null,null,null,41006,985.80817689537298,{"$f":"VLOOKUP(E2184,'[1]Combined AA and BB'!$A$1:$C$6133,3,FALSE)","v":"Y"}]
[null,null,null,null,41007,985.80817689537298,{"$f":"VLOOKUP(E2185,'[1]Combined AA and BB'!$A$1:$C$6133,3,FALSE)","v":"Y"}]
[null,null,null,null,41008,1916.5286762415849,{"$f":"VLOOKUP(E2186,'[1]Combined AA and BB'!$A$1:$C$6133,3,FALSE)","v":"Y"}]
[null,null,null,null,41009,396.81640340099921,{"$f":"VLOOKUP(E2187,'[1]Combined AA and BB'!$A$1:$C$6133,3,FALSE)","v":"Y"}]
[null,null,null,null,41010,985.80817689537298,{"$f":"VLOOKUP(E2188,'[1]Combined AA and BB'!$A$1:$C$6133,3,FALSE)","v":"Y"}]
[null,null,null,null,41015,396.81640340099921,{"$f":"VLOOKUP(E2189,'[1]Combined AA and BB'!$A$1:$C$6133,3,FALSE)","v":"Y"}]
[null,null,null,null,41016,4253.3690655926366,{"$f":"VLOOKUP(E2190,'[1]Combined AA and BB'!$A$1:$C$6133,3,FALSE)","v":"Y"}]
[null,null,null,null,41017,1916.5286762415849,{"$f":"VLOOKUP(E2191,'[1]Combined AA and BB'!$A$1:$C$6133,3,FALSE)","v":"Y"}]
[null,null,null,null,41018,985.80817689537298,{"$f":"VLOOKUP(E2192,'[1]Combined AA and BB'!$A$1:$C$6133,3,FALSE)","v":"Y"}]
[null,null,null,null,41019,"Not covered","NA"]
[null,null,null,null,41100,354.26300000000003,{"$f":"VLOOKUP(E2194,'[1]Combined AA and BB'!$A$1:$C$6133,3,FALSE)","v":"Y"}]
[null,null,null,null,41105,354.26300000000003,{"$f":"VLOOKUP(E2195,'[1]Combined AA and BB'!$A$1:$C$6133,3,FALSE)","v":"Y"}]
[null,null,null,null,41108,320.3252,{"$f":"VLOOKUP(E2196,'[1]Combined AA and BB'!$A$1:$C$6133,3,FALSE)","v":"Y"}]
[null,null,null,null,41110,"Not covered","NA"]
[null,null,null,null,41112,"Not covered","NA"]
[null,null,null,null,41113,"Not covered","NA"]
[null,null,null,null,41114,"Not covered","NA"]
[null,null,null,null,41115,497.15899999999999,{"$f":"VLOOKUP(E2201,'[1]Combined AA and BB'!$A$1:$C$6133,3,FALSE)","v":"Y"}]
[null,null,null,null,41116,"Not covered","NA"]
[null,null,null,null,41120,"Not covered","NA"]
[null,null,null,null,41250,"Bundled","NA"]
[null,null,null,null,41251,180.53152367673368,{"$f":"VLOOKUP(E2205,'[1]Combined AA and BB'!$A$1:$C$6133,3,FALSE)","v":"Y"}]
[null,null,null,null,41252,180.53152367673368,{"$f":"VLOOKUP(E2206,'[1]Combined AA and BB'!$A$1:$C$6133,3,FALSE)","v":"Y"}]
[null,null,null,null,41510,"Not covered","NA"]
[null,null,null,null,41520,1916.5286762415849,{"$f":"VLOOKUP(E2208,'[1]Combined AA and BB'!$A$1:$C$6133,3,FALSE)","v":"Y"}]
[null,null,null,null,41530,1762.9793999999999,{"$f":"VLOOKUP(E2209,'[1]Combined AA and BB'!$A$1:$C$6133,3,FALSE)","v":"Y"}]
[null,null,null,null,41800,"Bundled","NA"]
[null,null,null,null,41805,594.20920000000001,{"$f":"VLOOKUP(E2211,'[1]Combined AA and BB'!$A$1:$C$6133,3,FALSE)","v":"Y"}]
[null,null,null,null,41806,778.18780000000004,{"$f":"VLOOKUP(E2212,'[1]Combined AA and BB'!$A$1:$C$6133,3,FALSE)","v":"Y"}]
[null,null,null,null,41820,"Not covered","NA"]
[null,null,null,null,41821,"Not covered","NA"]
[null,null,null,null,41822,"Not covered","NA"]
[null,null,null,null,41823,"Not covered","NA"]
[null,null,null,null,41825,"Not covered","NA"]
[null,null,null,null,41826,"Not covered","NA"]
[null,null,null,null,41827,"Not covered","NA"]
[null,null,null,null,41828,"Not covered","NA"]
[null,null,null,null,41830,"Not covered","NA"]
[null,null,null,null,41850,985.80817689537298,{"$f":"VLOOKUP(E2222,'[1]Combined AA and BB'!$A$1:$C$6133,3,FALSE)","v":"Y"}]
[null,null,null,null,41870,985.80817689537298,{"$f":"VLOOKUP(E2223,'[1]Combined AA and BB'!$A$1:$C$6133,3,FALSE)","v":"Y"}]
[null,null,null,null,41872,889.52760000000001,{"$f":"VLOOKUP(E2224,'[1]Combined AA and BB'!$A$1:$C$6133,3,FALSE)","v":"Y"}]
[null,null,null,null,41874,716.26619999999991,{"$f":"VLOOKUP(E2225,'[1]Combined AA and BB'!$A$1:$C$6133,3,FALSE)","v":"Y"}]
[null,null,null,null,42000,180.53152367673368,{"$f":"VLOOKUP(E2226,'[1]Combined AA and BB'!$A$1:$C$6133,3,FALSE)","v":"Y"}]
[null,null,null,null,42100,"Not covered","NA"]
[null,null,null,null,42104,"Not covered","NA"]
[null,null,null,null,42106,"Not covered","NA"]
[null,null,null,null,42107,"Not covered","NA"]
[null,null,null,null,42120,"Not covered","NA"]
[null,null,null,null,42140,1916.5286762415849,{"$f":"VLOOKUP(E2232,'[1]Combined AA and BB'!$A$1:$C$6133,3,FALSE)","v":"Y"}]
[null,null,null,null,42145,4253.3690655926366,{"$f":"VLOOKUP(E2233,'[1]Combined AA and BB'!$A$1:$C$6133,3,FALSE)","v":"Y"}]
[null,null,null,null,42160,"Not covered","NA"]
[null,null,null,null,42180,396.81640340099921,{"$f":"VLOOKUP(E2235,'[1]Combined AA and BB'!$A$1:$C$6133,3,FALSE)","v":"Y"}]
[null,null,null,null,42182,4253.3690655926366,{"$f":"VLOOKUP(E2236,'[1]Combined AA and BB'!$A$1:$C$6133,3,FALSE)","v":"Y"}]
[null,null,null,null,42200,"Not covered","NA"]
[null,null,null,null,42205,"Not covered","NA"]
[null,null,null,null,42210,"Not covered","NA"]
[null,null,null,null,42215,"Not covered","NA"]
[null,null,null,null,42220,"Not covered","NA"]
[null,null,null,null,42226,4253.3690655926366,{"$f":"VLOOKUP(E2242,'[1]Combined AA and BB'!$A$1:$C$6133,3,FALSE)","v":"Y"}]
[null,null,null,null,42235,4253.3690655926366,{"$f":"VLOOKUP(E2243,'[1]Combined AA and BB'!$A$1:$C$6133,3,FALSE)","v":"Y"}]
[null,null,null,null,42260,4253.3690655926366,{"$f":"VLOOKUP(E2244,'[1]Combined AA and BB'!$A$1:$C$6133,3,FALSE)","v":"Y"}]
[null,null,null,null,42280,334.01940000000002,{"$f":"VLOOKUP(E2245,'[1]Combined AA and BB'!$A$1:$C$6133,3,FALSE)","v":"Y"}]
[null,null,null,null,42281,4253.3690655926366,{"$f":"VLOOKUP(E2246,'[1]Combined AA and BB'!$A$1:$C$6133,3,FALSE)","v":"Y"}]
[null,null,null,null,42300,985.80817689537298,{"$f":"VLOOKUP(E2247,'[1]Combined AA and BB'!$A$1:$C$6133,3,FALSE)","v":"Y"}]
[null,null,null,null,42305,1916.5286762415849,{"$f":"VLOOKUP(E2248,'[1]Combined AA and BB'!$A$1:$C$6133,3,FALSE)","v":"Y"}]
[null,null,null,null,42310,396.81640340099921,{"$f":"VLOOKUP(E2249,'[1]Combined AA and BB'!$A$1:$C$6133,3,FALSE)","v":"Y"}]
[null,null,null,null,42320,396.81640340099921,{"$f":"VLOOKUP(E2250,'[1]Combined AA and BB'!$A$1:$C$6133,3,FALSE)","v":"Y"}]
[null,null,null,null,42330,"Not covered","NA"]
[null,null,null,null,42335,"Not covered","NA"]
[null,null,null,null,42340,"Not covered","NA"]
[null,null,null,null,42400,182.78779999999998,{"$f":"VLOOKUP(E2254,'[1]Combined AA and BB'!$A$1:$C$6133,3,FALSE)","v":"Y"}]
[null,null,null,null,42405,985.80817689537298,{"$f":"VLOOKUP(E2255,'[1]Combined AA and BB'!$A$1:$C$6133,3,FALSE)","v":"Y"}]
[null,null,null,null,42408,1916.5286762415849,{"$f":"VLOOKUP(E2256,'[1]Combined AA and BB'!$A$1:$C$6133,3,FALSE)","v":"Y"}]
[null,null,null,null,42409,1916.5286762415849,{"$f":"VLOOKUP(E2257,'[1]Combined AA and BB'!$A$1:$C$6133,3,FALSE)","v":"Y"}]
[null,null,null,null,42410,"Not covered","NA"]
[null,null,null,null,42415,"Not covered","NA"]
[null,null,null,null,42420,"Not covered","NA"]
[null,null,null,null,42425,"Not covered","NA"]
[null,null,null,null,42440,4253.3690655926366,{"$f":"VLOOKUP(E2262,'[1]Combined AA and BB'!$A$1:$C$6133,3,FALSE)","v":"Y"}]
[null,null,null,null,42450,4253.3690655926366,{"$f":"VLOOKUP(E2263,'[1]Combined AA and BB'!$A$1:$C$6133,3,FALSE)","v":"Y"}]
[null,null,null,null,42500,4253.3690655926366,{"$f":"VLOOKUP(E2264,'[1]Combined AA and BB'!$A$1:$C$6133,3,FALSE)","v":"Y"}]
[null,null,null,null,42505,4253.3690655926366,{"$f":"VLOOKUP(E2265,'[1]Combined AA and BB'!$A$1:$C$6133,3,FALSE)","v":"Y"}]
[null,null,null,null,42507,4253.3690655926366,{"$f":"VLOOKUP(E2266,'[1]Combined AA and BB'!$A$1:$C$6133,3,FALSE)","v":"Y"}]
[null,null,null,null,42509,4253.3690655926366,{"$f":"VLOOKUP(E2267,'[1]Combined AA and BB'!$A$1:$C$6133,3,FALSE)","v":"Y"}]
[null,null,null,null,42510,1916.5286762415849,{"$f":"VLOOKUP(E2268,'[1]Combined AA and BB'!$A$1:$C$6133,3,FALSE)","v":"Y"}]
[null,null,null,null,42550,"Bundled","NA"]
[null,null,null,null,42600,1916.5286762415849,{"$f":"VLOOKUP(E2270,'[1]Combined AA and BB'!$A$1:$C$6133,3,FALSE)","v":"Y"}]
[null,null,null,null,42650,139.3236,{"$f":"VLOOKUP(E2271,'[1]Combined AA and BB'!$A$1:$C$6133,3,FALSE)","v":"Y"}]
[null,null,null,null,42660,216.1302,{"$f":"VLOOKUP(E2272,'[1]Combined AA and BB'!$A$1:$C$6133,3,FALSE)","v":"Y"}]
[null,null,null,null,42665,"Not covered","NA"]
[null,null,null,null,42700,180.53152367673368,{"$f":"VLOOKUP(E2274,'[1]Combined AA and BB'!$A$1:$C$6133,3,FALSE)","v":"Y"}]
[null,null,null,null,42720,1916.5286762415849,{"$f":"VLOOKUP(E2275,'[1]Combined AA and BB'!$A$1:$C$6133,3,FALSE)","v":"Y"}]
[null,null,null,null,42725,4253.3690655926366,{"$f":"VLOOKUP(E2276,'[1]Combined AA and BB'!$A$1:$C$6133,3,FALSE)","v":"Y"}]
[null,null,null,null,42800,297.7,{"$f":"VLOOKUP(E2277,'[1]Combined AA and BB'!$A$1:$C$6133,3,FALSE)","v":"Y"}]
[null,null,null,null,42804,1916.5286762415849,{"$f":"VLOOKUP(E2278,'[1]Combined AA and BB'!$A$1:$C$6133,3,FALSE)","v":"Y"}]
[null,null,null,null,42806,1916.5286762415849,{"$f":"VLOOKUP(E2279,'[1]Combined AA and BB'!$A$1:$C$6133,3,FALSE)","v":"Y"}]
[null,null,null,null,42808,1916.5286762415849,{"$f":"VLOOKUP(E2280,'[1]Combined AA and BB'!$A$1:$C$6133,3,FALSE)","v":"Y"}]
[null,null,null,null,42809,"Bundled","NA"]
[null,null,null,null,42810,1916.5286762415849,{"$f":"VLOOKUP(E2282,'[1]Combined AA and BB'!$A$1:$C$6133,3,FALSE)","v":"Y"}]
[null,null,null,null,42815,4253.3690655926366,{"$f":"VLOOKUP(E2283,'[1]Combined AA and BB'!$A$1:$C$6133,3,FALSE)","v":"Y"}]
[null,null,null,null,42820,"Not covered","NA"]
[null,null,null,null,42821,1916.5286762415849,{"$f":"VLOOKUP(E2285,'[1]Combined AA and BB'!$A$1:$C$6133,3,FALSE)","v":"Y"}]
[null,null,null,null,42825,"Not covered","NA"]
[null,null,null,null,42826,1916.5286762415849,{"$f":"VLOOKUP(E2287,'[1]Combined AA and BB'!$A$1:$C$6133,3,FALSE)","v":"Y"}]
[null,null,null,null,42830,"Not covered","NA"]
[null,null,null,null,42831,"Not covered","NA"]
[null,null,null,null,42835,"Not covered","NA"]
[null,null,null,null,42836,"Not covered","NA"]
[null,null,null,null,42860,"Not covered","NA"]
[null,null,null,null,42870,4253.3690655926366,{"$f":"VLOOKUP(E2293,'[1]Combined AA and BB'!$A$1:$C$6133,3,FALSE)","v":"Y"}]
[null,null,null,null,42890,"Not covered","NA"]
[null,null,null,null,42892,"Not covered","NA"]
[null,null,null,null,42900,2246.3827184931879,{"$f":"VLOOKUP(E2296,'[1]Combined AA and BB'!$A$1:$C$6133,3,FALSE)","v":"Y"}]
[null,null,null,null,42950,4253.3690655926366,{"$f":"VLOOKUP(E2297,'[1]Combined AA and BB'!$A$1:$C$6133,3,FALSE)","v":"Y"}]
[null,null,null,null,42955,985.80817689537298,{"$f":"VLOOKUP(E2298,'[1]Combined AA and BB'!$A$1:$C$6133,3,FALSE)","v":"Y"}]
[null,null,null,null,42960,396.81640340099921,{"$f":"VLOOKUP(E2299,'[1]Combined AA and BB'!$A$1:$C$6133,3,FALSE)","v":"Y"}]
[null,null,null,null,42962,1916.5286762415849,{"$f":"VLOOKUP(E2300,'[1]Combined AA and BB'!$A$1:$C$6133,3,FALSE)","v":"Y"}]
[null,null,null,null,42970,180.53152367673368,{"$f":"VLOOKUP(E2301,'[1]Combined AA and BB'!$A$1:$C$6133,3,FALSE)","v":"Y"}]
[null,null,null,null,42972,1916.5286762415849,{"$f":"VLOOKUP(E2302,'[1]Combined AA and BB'!$A$1:$C$6133,3,FALSE)","v":"Y"}]
[null,null,null,null,42975,155.27147052919128,{"$f":"VLOOKUP(E2303,'[1]Combined AA and BB'!$A$1:$C$6133,3,FALSE)","v":"Y"}]
[null,null,null,null,43030,4253.3690655926366,{"$f":"VLOOKUP(E2304,'[1]Combined AA and BB'!$A$1:$C$6133,3,FALSE)","v":"Y"}]
[null,null,null,null,43180,4253.3690655926366,{"$f":"VLOOKUP(E2305,'[1]Combined AA and BB'!$A$1:$C$6133,3,FALSE)","v":"Y"}]
[null,null,null,null,43191,1255.4159907297244,{"$f":"VLOOKUP(E2306,'[1]Combined AA and BB'!$A$1:$C$6133,3,FALSE)","v":"Y"}]
[null,null,null,null,43192,1255.4159907297244,{"$f":"VLOOKUP(E2307,'[1]Combined AA and BB'!$A$1:$C$6133,3,FALSE)","v":"Y"}]
[null,null,null,null,43193,1255.4159907297244,{"$f":"VLOOKUP(E2308,'[1]Combined AA and BB'!$A$1:$C$6133,3,FALSE)","v":"Y"}]
[null,null,null,null,43194,1255.4159907297244,{"$f":"VLOOKUP(E2309,'[1]Combined AA and BB'!$A$1:$C$6133,3,FALSE)","v":"Y"}]
[null,null,null,null,43195,2504.7332357508817,{"$f":"VLOOKUP(E2310,'[1]Combined AA and BB'!$A$1:$C$6133,3,FALSE)","v":"Y"}]
[null,null,null,null,43196,2504.7332357508817,{"$f":"VLOOKUP(E2311,'[1]Combined AA and BB'!$A$1:$C$6133,3,FALSE)","v":"Y"}]
[null,null,null,null,43197,360.21699999999998,{"$f":"VLOOKUP(E2312,'[1]Combined AA and BB'!$A$1:$C$6133,3,FALSE)","v":"Y"}]
[null,null,null,null,43198,399.51339999999999,{"$f":"VLOOKUP(E2313,'[1]Combined AA and BB'!$A$1:$C$6133,3,FALSE)","v":"Y"}]
[null,null,null,null,43200,717.08273478055889,{"$f":"VLOOKUP(E2314,'[1]Combined AA and BB'!$A$1:$C$6133,3,FALSE)","v":"Y"}]
[null,null,null,null,43201,1255.4159907297244,{"$f":"VLOOKUP(E2315,'[1]Combined AA and BB'!$A$1:$C$6133,3,FALSE)","v":"Y"}]
[null,null,null,null,43202,1255.4159907297244,{"$f":"VLOOKUP(E2316,'[1]Combined AA and BB'!$A$1:$C$6133,3,FALSE)","v":"Y"}]
[null,null,null,null,43204,1255.4159907297244,{"$f":"VLOOKUP(E2317,'[1]Combined AA and BB'!$A$1:$C$6133,3,FALSE)","v":"Y"}]
[null,null,null,null,43205,1255.4159907297244,{"$f":"VLOOKUP(E2318,'[1]Combined AA and BB'!$A$1:$C$6133,3,FALSE)","v":"Y"}]
[null,null,null,null,43206,1255.4159907297244,{"$f":"VLOOKUP(E2319,'[1]Combined AA and BB'!$A$1:$C$6133,3,FALSE)","v":"Y"}]
[null,null,null,null,43210,12347.034756290035,{"$f":"VLOOKUP(E2320,'[1]Combined AA and BB'!$A$1:$C$6133,3,FALSE)","v":"Y"}]
[null,null,null,null,43211,1255.4159907297244,{"$f":"VLOOKUP(E2321,'[1]Combined AA and BB'!$A$1:$C$6133,3,FALSE)","v":"Y"}]
[null,null,null,null,43212,7725.4535201549879,{"$f":"VLOOKUP(E2322,'[1]Combined AA and BB'!$A$1:$C$6133,3,FALSE)","v":"Y"}]
[null,null,null,null,43213,1255.4159907297244,{"$f":"VLOOKUP(E2323,'[1]Combined AA and BB'!$A$1:$C$6133,3,FALSE)","v":"Y"}]
[null,null,null,null,43214,1255.4159907297244,{"$f":"VLOOKUP(E2324,'[1]Combined AA and BB'!$A$1:$C$6133,3,FALSE)","v":"Y"}]
[null,null,null,null,43215,1255.4159907297244,{"$f":"VLOOKUP(E2325,'[1]Combined AA and BB'!$A$1:$C$6133,3,FALSE)","v":"Y"}]
[null,null,null,null,43216,"Not covered","NA"]
[null,null,null,null,43217,"Not covered","NA"]
[null,null,null,null,43220,1255.4159907297244,{"$f":"VLOOKUP(E2328,'[1]Combined AA and BB'!$A$1:$C$6133,3,FALSE)","v":"Y"}]
[null,null,null,null,43226,1255.4159907297244,{"$f":"VLOOKUP(E2329,'[1]Combined AA and BB'!$A$1:$C$6133,3,FALSE)","v":"Y"}]
[null,null,null,null,43227,1255.4159907297244,{"$f":"VLOOKUP(E2330,'[1]Combined AA and BB'!$A$1:$C$6133,3,FALSE)","v":"Y"}]
[null,null,null,null,43229,"Not covered","NA"]
[null,null,null,null,43231,1255.4159907297244,{"$f":"VLOOKUP(E2332,'[1]Combined AA and BB'!$A$1:$C$6133,3,FALSE)","v":"Y"}]
[null,null,null,null,43232,1255.4159907297244,{"$f":"VLOOKUP(E2333,'[1]Combined AA and BB'!$A$1:$C$6133,3,FALSE)","v":"Y"}]
[null,null,null,null,43233,1255.4159907297244,{"$f":"VLOOKUP(E2334,'[1]Combined AA and BB'!$A$1:$C$6133,3,FALSE)","v":"Y"}]
[null,null,null,null,43235,717.08273478055889,{"$f":"VLOOKUP(E2335,'[1]Combined AA and BB'!$A$1:$C$6133,3,FALSE)","v":"Y"}]
[null,null,null,null,43236,717.08273478055889,{"$f":"VLOOKUP(E2336,'[1]Combined AA and BB'!$A$1:$C$6133,3,FALSE)","v":"Y"}]
[null,null,null,null,43237,"Not covered","NA"]
[null,null,null,null,43238,"Not covered","NA"]
[null,null,null,null,43239,717.08273478055889,{"$f":"VLOOKUP(E2339,'[1]Combined AA and BB'!$A$1:$C$6133,3,FALSE)","v":"Y"}]
[null,null,null,null,43240,8289.5590419371838,{"$f":"VLOOKUP(E2340,'[1]Combined AA and BB'!$A$1:$C$6133,3,FALSE)","v":"Y"}]
[null,null,null,null,43241,1255.4159907297244,{"$f":"VLOOKUP(E2341,'[1]Combined AA and BB'!$A$1:$C$6133,3,FALSE)","v":"Y"}]
[null,null,null,null,43242,1255.4159907297244,{"$f":"VLOOKUP(E2342,'[1]Combined AA and BB'!$A$1:$C$6133,3,FALSE)","v":"Y"}]
[null,null,null,null,43243,1255.4159907297244,{"$f":"VLOOKUP(E2343,'[1]Combined AA and BB'!$A$1:$C$6133,3,FALSE)","v":"Y"}]
[null,null,null,null,43244,1255.4159907297244,{"$f":"VLOOKUP(E2344,'[1]Combined AA and BB'!$A$1:$C$6133,3,FALSE)","v":"Y"}]
[null,null,null,null,43245,1255.4159907297244,{"$f":"VLOOKUP(E2345,'[1]Combined AA and BB'!$A$1:$C$6133,3,FALSE)","v":"Y"}]
[null,null,null,null,43246,1255.4159907297244,{"$f":"VLOOKUP(E2346,'[1]Combined AA and BB'!$A$1:$C$6133,3,FALSE)","v":"Y"}]
[null,null,null,null,43247,717.08273478055889,{"$f":"VLOOKUP(E2347,'[1]Combined AA and BB'!$A$1:$C$6133,3,FALSE)","v":"Y"}]
[null,null,null,null,43248,717.08273478055889,{"$f":"VLOOKUP(E2348,'[1]Combined AA and BB'!$A$1:$C$6133,3,FALSE)","v":"Y"}]
[null,null,null,null,43249,1255.4159907297244,{"$f":"VLOOKUP(E2349,'[1]Combined AA and BB'!$A$1:$C$6133,3,FALSE)","v":"Y"}]
[null,null,null,null,43250,1255.4159907297244,{"$f":"VLOOKUP(E2350,'[1]Combined AA and BB'!$A$1:$C$6133,3,FALSE)","v":"Y"}]
[null,null,null,null,43251,1255.4159907297244,{"$f":"VLOOKUP(E2351,'[1]Combined AA and BB'!$A$1:$C$6133,3,FALSE)","v":"Y"}]
[null,null,null,null,43252,2504.7332357508817,{"$f":"VLOOKUP(E2352,'[1]Combined AA and BB'!$A$1:$C$6133,3,FALSE)","v":"Y"}]
[null,null,null,null,43253,1255.4159907297244,{"$f":"VLOOKUP(E2353,'[1]Combined AA and BB'!$A$1:$C$6133,3,FALSE)","v":"Y"}]
[null,null,null,null,43254,1255.4159907297244,{"$f":"VLOOKUP(E2354,'[1]Combined AA and BB'!$A$1:$C$6133,3,FALSE)","v":"Y"}]
[null,null,null,null,43255,1255.4159907297244,{"$f":"VLOOKUP(E2355,'[1]Combined AA and BB'!$A$1:$C$6133,3,FALSE)","v":"Y"}]
[null,null,null,null,43257,"Not covered","NA"]
[null,null,null,null,43259,1255.4159907297244,{"$f":"VLOOKUP(E2357,'[1]Combined AA and BB'!$A$1:$C$6133,3,FALSE)","v":"Y"}]
[null,null,null,null,43260,2504.7332357508817,{"$f":"VLOOKUP(E2358,'[1]Combined AA and BB'!$A$1:$C$6133,3,FALSE)","v":"Y"}]
[null,null,null,null,43261,2504.7332357508817,{"$f":"VLOOKUP(E2359,'[1]Combined AA and BB'!$A$1:$C$6133,3,FALSE)","v":"Y"}]
[null,null,null,null,43262,2504.7332357508817,{"$f":"VLOOKUP(E2360,'[1]Combined AA and BB'!$A$1:$C$6133,3,FALSE)","v":"Y"}]
[null,null,null,null,43263,2504.7332357508817,{"$f":"VLOOKUP(E2361,'[1]Combined AA and BB'!$A$1:$C$6133,3,FALSE)","v":"Y"}]
[null,null,null,null,43264,2504.7332357508817,{"$f":"VLOOKUP(E2362,'[1]Combined AA and BB'!$A$1:$C$6133,3,FALSE)","v":"Y"}]
[null,null,null,null,43265,3792.6585688533673,{"$f":"VLOOKUP(E2363,'[1]Combined AA and BB'!$A$1:$C$6133,3,FALSE)","v":"Y"}]
[null,null,null,null,43266,7918.3869650228862,{"$f":"VLOOKUP(E2364,'[1]Combined AA and BB'!$A$1:$C$6133,3,FALSE)","v":"Y"}]
[null,null,null,null,43270,"Not covered","NA"]
[null,null,null,null,43273,"Bundled","NA"]
[null,null,null,null,43274,6519.6024159744284,{"$f":"VLOOKUP(E2367,'[1]Combined AA and BB'!$A$1:$C$6133,3,FALSE)","v":"Y"}]
[null,null,null,null,43275,2504.7332357508817,{"$f":"VLOOKUP(E2368,'[1]Combined AA and BB'!$A$1:$C$6133,3,FALSE)","v":"Y"}]
[null,null,null,null,43276,6557.2671221141263,{"$f":"VLOOKUP(E2369,'[1]Combined AA and BB'!$A$1:$C$6133,3,FALSE)","v":"Y"}]
[null,null,null,null,43277,2504.7332357508817,{"$f":"VLOOKUP(E2370,'[1]Combined AA and BB'!$A$1:$C$6133,3,FALSE)","v":"Y"}]
[null,null,null,null,43278,"Not covered","NA"]
[null,null,null,null,43284,13767.138735559,{"$f":"VLOOKUP(E2372,'[1]Combined AA and BB'!$A$1:$C$6133,3,FALSE)","v":"Y"}]
[null,null,null,null,43285,4168.5316199700519,{"$f":"VLOOKUP(E2373,'[1]Combined AA and BB'!$A$1:$C$6133,3,FALSE)","v":"N"}]
[null,null,null,null,43290,"Not covered","NA"]
[null,null,null,null,43291,"Not covered","NA"]
[null,null,null,null,43450,717.08273478055889,{"$f":"VLOOKUP(E2376,'[1]Combined AA and BB'!$A$1:$C$6133,3,FALSE)","v":"Y"}]
[null,null,null,null,43453,1255.4159907297244,{"$f":"VLOOKUP(E2377,'[1]Combined AA and BB'!$A$1:$C$6133,3,FALSE)","v":"Y"}]
[null,null,null,null,43653,4168.5316199700519,{"$f":"VLOOKUP(E2378,'[1]Combined AA and BB'!$A$1:$C$6133,3,FALSE)","v":"Y"}]
[null,null,null,null,43753,"Bundled","NA"]
[null,null,null,null,43754,"Bundled","NA"]
[null,null,null,null,43755,126.32621784711014,{"$f":"VLOOKUP(E2381,'[1]Combined AA and BB'!$A$1:$C$6133,3,FALSE)","v":"N"}]
[null,null,null,null,43756,717.08273478055889,{"$f":"VLOOKUP(E2382,'[1]Combined AA and BB'!$A$1:$C$6133,3,FALSE)","v":"N"}]
[null,null,null,null,43757,717.08273478055889,{"$f":"VLOOKUP(E2383,'[1]Combined AA and BB'!$A$1:$C$6133,3,FALSE)","v":"Y"}]
[null,null,null,null,43761,186.64757079156672,{"$f":"VLOOKUP(E2384,'[1]Combined AA and BB'!$A$1:$C$6133,3,FALSE)","v":"Y"}]
[null,null,null,null,43762,186.64757079156672,{"$f":"VLOOKUP(E2385,'[1]Combined AA and BB'!$A$1:$C$6133,3,FALSE)","v":"Y"}]
[null,null,null,null,43763,186.64757079156672,{"$f":"VLOOKUP(E2386,'[1]Combined AA and BB'!$A$1:$C$6133,3,FALSE)","v":"Y"}]
[null,null,null,null,43870,2504.7332357508817,{"$f":"VLOOKUP(E2387,'[1]Combined AA and BB'!$A$1:$C$6133,3,FALSE)","v":"Y"}]
[null,null,null,null,43886,"Not covered","NA"]
[null,null,null,null,43887,"Not covered","NA"]
[null,null,null,null,43888,"Not covered","NA"]
[null,null,null,null,44100,717.08273478055889,{"$f":"VLOOKUP(E2391,'[1]Combined AA and BB'!$A$1:$C$6133,3,FALSE)","v":"Y"}]
[null,null,null,null,44312,2825.7867811155184,{"$f":"VLOOKUP(E2392,'[1]Combined AA and BB'!$A$1:$C$6133,3,FALSE)","v":"Y"}]
[null,null,null,null,44340,2825.7867811155184,{"$f":"VLOOKUP(E2393,'[1]Combined AA and BB'!$A$1:$C$6133,3,FALSE)","v":"Y"}]
[null,null,null,null,44360,1255.4159907297244,{"$f":"VLOOKUP(E2394,'[1]Combined AA and BB'!$A$1:$C$6133,3,FALSE)","v":"Y"}]
[null,null,null,null,44361,1255.4159907297244,{"$f":"VLOOKUP(E2395,'[1]Combined AA and BB'!$A$1:$C$6133,3,FALSE)","v":"Y"}]
[null,null,null,null,44363,1255.4159907297244,{"$f":"VLOOKUP(E2396,'[1]Combined AA and BB'!$A$1:$C$6133,3,FALSE)","v":"Y"}]
[null,null,null,null,44364,"Not covered","NA"]
[null,null,null,null,44365,"Not covered","NA"]
[null,null,null,null,44366,1255.4159907297244,{"$f":"VLOOKUP(E2399,'[1]Combined AA and BB'!$A$1:$C$6133,3,FALSE)","v":"Y"}]
[null,null,null,null,44369,"Not covered","NA"]
[null,null,null,null,44370,8588.6115727344895,{"$f":"VLOOKUP(E2401,'[1]Combined AA and BB'!$A$1:$C$6133,3,FALSE)","v":"Y"}]
[null,null,null,null,44372,1255.4159907297244,{"$f":"VLOOKUP(E2402,'[1]Combined AA and BB'!$A$1:$C$6133,3,FALSE)","v":"Y"}]
[null,null,null,null,44373,1255.4159907297244,{"$f":"VLOOKUP(E2403,'[1]Combined AA and BB'!$A$1:$C$6133,3,FALSE)","v":"Y"}]
[null,null,null,null,44376,1255.4159907297244,{"$f":"VLOOKUP(E2404,'[1]Combined AA and BB'!$A$1:$C$6133,3,FALSE)","v":"Y"}]
[null,null,null,null,44377,1255.4159907297244,{"$f":"VLOOKUP(E2405,'[1]Combined AA and BB'!$A$1:$C$6133,3,FALSE)","v":"Y"}]
[null,null,null,null,44378,1255.4159907297244,{"$f":"VLOOKUP(E2406,'[1]Combined AA and BB'!$A$1:$C$6133,3,FALSE)","v":"Y"}]
[null,null,null,null,44379,3792.6585688533673,{"$f":"VLOOKUP(E2407,'[1]Combined AA and BB'!$A$1:$C$6133,3,FALSE)","v":"Y"}]
[null,null,null,null,44380,717.08273478055889,{"$f":"VLOOKUP(E2408,'[1]Combined AA and BB'!$A$1:$C$6133,3,FALSE)","v":"Y"}]
[null,null,null,null,44381,"Not covered","NA"]
[null,null,null,null,44382,717.08273478055889,{"$f":"VLOOKUP(E2410,'[1]Combined AA and BB'!$A$1:$C$6133,3,FALSE)","v":"Y"}]
[null,null,null,null,44384,"Not covered","NA"]
[null,null,null,null,44385,721.89252572235137,{"$f":"VLOOKUP(E2412,'[1]Combined AA and BB'!$A$1:$C$6133,3,FALSE)","v":"Y"}]
[null,null,null,null,44386,721.89252572235137,{"$f":"VLOOKUP(E2413,'[1]Combined AA and BB'!$A$1:$C$6133,3,FALSE)","v":"Y"}]
[null,null,null,null,44388,721.89252572235137,{"$f":"VLOOKUP(E2414,'[1]Combined AA and BB'!$A$1:$C$6133,3,FALSE)","v":"Y"}]
[null,null,null,null,44389,940.67745865197276,{"$f":"VLOOKUP(E2415,'[1]Combined AA and BB'!$A$1:$C$6133,3,FALSE)","v":"Y"}]
[null,null,null,null,44390,1328.895973739378,{"$f":"VLOOKUP(E2416,'[1]Combined AA and BB'!$A$1:$C$6133,3,FALSE)","v":"Y"}]
[null,null,null,null,44391,940.67745865197276,{"$f":"VLOOKUP(E2417,'[1]Combined AA and BB'!$A$1:$C$6133,3,FALSE)","v":"Y"}]
[null,null,null,null,44392,940.67745865197276,{"$f":"VLOOKUP(E2418,'[1]Combined AA and BB'!$A$1:$C$6133,3,FALSE)","v":"Y"}]
[null,null,null,null,44394,940.67745865197276,{"$f":"VLOOKUP(E2419,'[1]Combined AA and BB'!$A$1:$C$6133,3,FALSE)","v":"Y"}]
[null,null,null,null,44401,"Not covered","NA"]
[null,null,null,null,44402,"Not covered","NA"]
[null,null,null,null,44403,"Not covered","NA"]
[null,null,null,null,44404,"Not covered","NA"]
[null,null,null,null,44405,"Not covered","NA"]
[null,null,null,null,44406,"Not covered","NA"]
[null,null,null,null,44407,"Not covered","NA"]
[null,null,null,null,44408,"Not covered","NA"]
[null,null,null,null,44500,717.08273478055889,{"$f":"VLOOKUP(E2428,'[1]Combined AA and BB'!$A$1:$C$6133,3,FALSE)","v":"Y"}]
[null,null,null,null,44701,"Bundled","NA"]
[null,null,null,null,45000,940.67745865197276,{"$f":"VLOOKUP(E2430,'[1]Combined AA and BB'!$A$1:$C$6133,3,FALSE)","v":"Y"}]
[null,null,null,null,45005,940.67745865197276,{"$f":"VLOOKUP(E2431,'[1]Combined AA and BB'!$A$1:$C$6133,3,FALSE)","v":"Y"}]
[null,null,null,null,45020,2060.0784440259408,{"$f":"VLOOKUP(E2432,'[1]Combined AA and BB'!$A$1:$C$6133,3,FALSE)","v":"Y"}]
[null,null,null,null,45100,2060.0784440259408,{"$f":"VLOOKUP(E2433,'[1]Combined AA and BB'!$A$1:$C$6133,3,FALSE)","v":"Y"}]
[null,null,null,null,45108,2060.0784440259408,{"$f":"VLOOKUP(E2434,'[1]Combined AA and BB'!$A$1:$C$6133,3,FALSE)","v":"Y"}]
[null,null,null,null,45150,940.67745865197276,{"$f":"VLOOKUP(E2435,'[1]Combined AA and BB'!$A$1:$C$6133,3,FALSE)","v":"Y"}]
[null,null,null,null,45160,"Not covered","NA"]
[null,null,null,null,45190,"Not covered","NA"]
[null,null,null,null,45300,242.92320000000001,{"$f":"VLOOKUP(E2438,'[1]Combined AA and BB'!$A$1:$C$6133,3,FALSE)","v":"Y"}]
[null,null,null,null,45303,940.67745865197276,{"$f":"VLOOKUP(E2439,'[1]Combined AA and BB'!$A$1:$C$6133,3,FALSE)","v":"Y"}]
[null,null,null,null,45305,940.67745865197276,{"$f":"VLOOKUP(E2440,'[1]Combined AA and BB'!$A$1:$C$6133,3,FALSE)","v":"Y"}]
[null,null,null,null,45307,2060.0784440259408,{"$f":"VLOOKUP(E2441,'[1]Combined AA and BB'!$A$1:$C$6133,3,FALSE)","v":"Y"}]
[null,null,null,null,45308,2060.0784440259408,{"$f":"VLOOKUP(E2442,'[1]Combined AA and BB'!$A$1:$C$6133,3,FALSE)","v":"Y"}]
[null,null,null,null,45309,940.67745865197276,{"$f":"VLOOKUP(E2443,'[1]Combined AA and BB'!$A$1:$C$6133,3,FALSE)","v":"Y"}]
[null,null,null,null,45315,940.67745865197276,{"$f":"VLOOKUP(E2444,'[1]Combined AA and BB'!$A$1:$C$6133,3,FALSE)","v":"Y"}]
[null,null,null,null,45317,940.67745865197276,{"$f":"VLOOKUP(E2445,'[1]Combined AA and BB'!$A$1:$C$6133,3,FALSE)","v":"Y"}]
[null,null,null,null,45320,2060.0784440259408,{"$f":"VLOOKUP(E2446,'[1]Combined AA and BB'!$A$1:$C$6133,3,FALSE)","v":"Y"}]
[null,null,null,null,45321,2060.0784440259408,{"$f":"VLOOKUP(E2447,'[1]Combined AA and BB'!$A$1:$C$6133,3,FALSE)","v":"Y"}]
[null,null,null,null,45327,8019.907519287005,{"$f":"VLOOKUP(E2448,'[1]Combined AA and BB'!$A$1:$C$6133,3,FALSE)","v":"Y"}]
[null,null,null,null,45330,354.26300000000003,{"$f":"VLOOKUP(E2449,'[1]Combined AA and BB'!$A$1:$C$6133,3,FALSE)","v":"Y"}]
[null,null,null,null,45331,721.89252572235137,{"$f":"VLOOKUP(E2450,'[1]Combined AA and BB'!$A$1:$C$6133,3,FALSE)","v":"Y"}]
[null,null,null,null,45332,940.67745865197276,{"$f":"VLOOKUP(E2451,'[1]Combined AA and BB'!$A$1:$C$6133,3,FALSE)","v":"Y"}]
[null,null,null,null,45333,721.89252572235137,{"$f":"VLOOKUP(E2452,'[1]Combined AA and BB'!$A$1:$C$6133,3,FALSE)","v":"Y"}]
[null,null,null,null,45334,940.67745865197276,{"$f":"VLOOKUP(E2453,'[1]Combined AA and BB'!$A$1:$C$6133,3,FALSE)","v":"Y"}]
[null,null,null,null,45335,721.89252572235137,{"$f":"VLOOKUP(E2454,'[1]Combined AA and BB'!$A$1:$C$6133,3,FALSE)","v":"Y"}]
[null,null,null,null,45337,721.89252572235137,{"$f":"VLOOKUP(E2455,'[1]Combined AA and BB'!$A$1:$C$6133,3,FALSE)","v":"Y"}]
[null,null,null,null,45338,940.67745865197276,{"$f":"VLOOKUP(E2456,'[1]Combined AA and BB'!$A$1:$C$6133,3,FALSE)","v":"Y"}]
[null,null,null,null,45340,940.67745865197276,{"$f":"VLOOKUP(E2457,'[1]Combined AA and BB'!$A$1:$C$6133,3,FALSE)","v":"Y"}]
[null,null,null,null,45341,721.89252572235137,{"$f":"VLOOKUP(E2458,'[1]Combined AA and BB'!$A$1:$C$6133,3,FALSE)","v":"Y"}]
[null,null,null,null,45342,940.67745865197276,{"$f":"VLOOKUP(E2459,'[1]Combined AA and BB'!$A$1:$C$6133,3,FALSE)","v":"Y"}]
[null,null,null,null,45346,"Not covered","NA"]
[null,null,null,null,45347,"Not covered","NA"]
[null,null,null,null,45349,"Not covered","NA"]
[null,null,null,null,45350,"Not covered","NA"]
[null,null,null,null,45378,721.89252572235137,{"$f":"VLOOKUP(E2464,'[1]Combined AA and BB'!$A$1:$C$6133,3,FALSE)","v":"Y"}]
[null,null,null,null,45379,940.67745865197276,{"$f":"VLOOKUP(E2465,'[1]Combined AA and BB'!$A$1:$C$6133,3,FALSE)","v":"Y"}]
[null,null,null,null,45380,940.67745865197276,{"$f":"VLOOKUP(E2466,'[1]Combined AA and BB'!$A$1:$C$6133,3,FALSE)","v":"Y"}]
[null,null,null,null,45381,"Not covered","NA"]
[null,null,null,null,45382,940.67745865197276,{"$f":"VLOOKUP(E2468,'[1]Combined AA and BB'!$A$1:$C$6133,3,FALSE)","v":"Y"}]
[null,null,null,null,45384,940.67745865197276,{"$f":"VLOOKUP(E2469,'[1]Combined AA and BB'!$A$1:$C$6133,3,FALSE)","v":"Y"}]
[null,null,null,null,45385,940.67745865197276,{"$f":"VLOOKUP(E2470,'[1]Combined AA and BB'!$A$1:$C$6133,3,FALSE)","v":"Y"}]
[null,null,null,null,45386,940.67745865197276,{"$f":"VLOOKUP(E2471,'[1]Combined AA and BB'!$A$1:$C$6133,3,FALSE)","v":"Y"}]
[null,null,null,null,45388,"Not covered","NA"]
[null,null,null,null,45389,"Not covered","NA"]
[null,null,null,null,45390,"Not covered","NA"]
[null,null,null,null,45391,940.67745865197276,{"$f":"VLOOKUP(E2475,'[1]Combined AA and BB'!$A$1:$C$6133,3,FALSE)","v":"Y"}]
[null,null,null,null,45392,940.67745865197276,{"$f":"VLOOKUP(E2476,'[1]Combined AA and BB'!$A$1:$C$6133,3,FALSE)","v":"Y"}]
[null,null,null,null,45393,"Not covered","NA"]
[null,null,null,null,45398,"Not covered","NA"]
[null,null,null,null,45500,2060.0784440259408,{"$f":"VLOOKUP(E2479,'[1]Combined AA and BB'!$A$1:$C$6133,3,FALSE)","v":"Y"}]
[null,null,null,null,45505,2060.0784440259408,{"$f":"VLOOKUP(E2480,'[1]Combined AA and BB'!$A$1:$C$6133,3,FALSE)","v":"Y"}]
[null,null,null,null,45520,"Bundled","NA"]
[null,null,null,null,45560,2060.0784440259408,{"$f":"VLOOKUP(E2482,'[1]Combined AA and BB'!$A$1:$C$6133,3,FALSE)","v":"Y"}]
[null,null,null,null,45900,721.89252572235137,{"$f":"VLOOKUP(E2483,'[1]Combined AA and BB'!$A$1:$C$6133,3,FALSE)","v":"Y"}]
[null,null,null,null,45905,940.67745865197276,{"$f":"VLOOKUP(E2484,'[1]Combined AA and BB'!$A$1:$C$6133,3,FALSE)","v":"Y"}]
[null,null,null,null,45910,940.67745865197276,{"$f":"VLOOKUP(E2485,'[1]Combined AA and BB'!$A$1:$C$6133,3,FALSE)","v":"Y"}]
[null,null,null,null,45915,940.67745865197276,{"$f":"VLOOKUP(E2486,'[1]Combined AA and BB'!$A$1:$C$6133,3,FALSE)","v":"Y"}]
[null,null,null,null,45990,2060.0784440259408,{"$f":"VLOOKUP(E2487,'[1]Combined AA and BB'!$A$1:$C$6133,3,FALSE)","v":"Y"}]
[null,null,null,null,46020,2060.0784440259408,{"$f":"VLOOKUP(E2488,'[1]Combined AA and BB'!$A$1:$C$6133,3,FALSE)","v":"Y"}]
[null,null,null,null,46030,940.67745865197276,{"$f":"VLOOKUP(E2489,'[1]Combined AA and BB'!$A$1:$C$6133,3,FALSE)","v":"Y"}]
[null,null,null,null,46040,940.67745865197276,{"$f":"VLOOKUP(E2490,'[1]Combined AA and BB'!$A$1:$C$6133,3,FALSE)","v":"Y"}]
[null,null,null,null,46045,2060.0784440259408,{"$f":"VLOOKUP(E2491,'[1]Combined AA and BB'!$A$1:$C$6133,3,FALSE)","v":"Y"}]
[null,null,null,null,46050,721.89252572235137,{"$f":"VLOOKUP(E2492,'[1]Combined AA and BB'!$A$1:$C$6133,3,FALSE)","v":"Y"}]
[null,null,null,null,46060,2060.0784440259408,{"$f":"VLOOKUP(E2493,'[1]Combined AA and BB'!$A$1:$C$6133,3,FALSE)","v":"Y"}]
[null,null,null,null,46070,"Not covered","NA"]
[null,null,null,null,46080,2060.0784440259408,{"$f":"VLOOKUP(E2495,'[1]Combined AA and BB'!$A$1:$C$6133,3,FALSE)","v":"Y"}]
[null,null,null,null,46083,186.64757079156672,{"$f":"VLOOKUP(E2496,'[1]Combined AA and BB'!$A$1:$C$6133,3,FALSE)","v":"Y"}]
[null,null,null,null,46200,2060.0784440259408,{"$f":"VLOOKUP(E2497,'[1]Combined AA and BB'!$A$1:$C$6133,3,FALSE)","v":"Y"}]
[null,null,null,null,46220,940.67745865197276,{"$f":"VLOOKUP(E2498,'[1]Combined AA and BB'!$A$1:$C$6133,3,FALSE)","v":"Y"}]
[null,null,null,null,46221,532.88299999999992,{"$f":"VLOOKUP(E2499,'[1]Combined AA and BB'!$A$1:$C$6133,3,FALSE)","v":"Y"}]
[null,null,null,null,46230,2060.0784440259408,{"$f":"VLOOKUP(E2500,'[1]Combined AA and BB'!$A$1:$C$6133,3,FALSE)","v":"Y"}]
[null,null,null,null,46250,2060.0784440259408,{"$f":"VLOOKUP(E2501,'[1]Combined AA and BB'!$A$1:$C$6133,3,FALSE)","v":"Y"}]
[null,null,null,null,46255,2060.0784440259408,{"$f":"VLOOKUP(E2502,'[1]Combined AA and BB'!$A$1:$C$6133,3,FALSE)","v":"Y"}]
[null,null,null,null,46257,2060.0784440259408,{"$f":"VLOOKUP(E2503,'[1]Combined AA and BB'!$A$1:$C$6133,3,FALSE)","v":"Y"}]
[null,null,null,null,46258,2060.0784440259408,{"$f":"VLOOKUP(E2504,'[1]Combined AA and BB'!$A$1:$C$6133,3,FALSE)","v":"Y"}]
[null,null,null,null,46260,2060.0784440259408,{"$f":"VLOOKUP(E2505,'[1]Combined AA and BB'!$A$1:$C$6133,3,FALSE)","v":"Y"}]
[null,null,null,null,46261,2060.0784440259408,{"$f":"VLOOKUP(E2506,'[1]Combined AA and BB'!$A$1:$C$6133,3,FALSE)","v":"Y"}]
[null,null,null,null,46262,2060.0784440259408,{"$f":"VLOOKUP(E2507,'[1]Combined AA and BB'!$A$1:$C$6133,3,FALSE)","v":"Y"}]
[null,null,null,null,46270,2060.0784440259408,{"$f":"VLOOKUP(E2508,'[1]Combined AA and BB'!$A$1:$C$6133,3,FALSE)","v":"Y"}]
[null,null,null,null,46275,2060.0784440259408,{"$f":"VLOOKUP(E2509,'[1]Combined AA and BB'!$A$1:$C$6133,3,FALSE)","v":"Y"}]
[null,null,null,null,46280,2060.0784440259408,{"$f":"VLOOKUP(E2510,'[1]Combined AA and BB'!$A$1:$C$6133,3,FALSE)","v":"Y"}]
[null,null,null,null,46285,2060.0784440259408,{"$f":"VLOOKUP(E2511,'[1]Combined AA and BB'!$A$1:$C$6133,3,FALSE)","v":"Y"}]
[null,null,null,null,46288,2060.0784440259408,{"$f":"VLOOKUP(E2512,'[1]Combined AA and BB'!$A$1:$C$6133,3,FALSE)","v":"Y"}]
[null,null,null,null,46320,401.89499999999998,{"$f":"VLOOKUP(E2513,'[1]Combined AA and BB'!$A$1:$C$6133,3,FALSE)","v":"Y"}]
[null,null,null,null,46500,597.78159999999991,{"$f":"VLOOKUP(E2514,'[1]Combined AA and BB'!$A$1:$C$6133,3,FALSE)","v":"Y"}]
[null,null,null,null,46505,940.67745865197276,{"$f":"VLOOKUP(E2515,'[1]Combined AA and BB'!$A$1:$C$6133,3,FALSE)","v":"Y"}]
[null,null,null,null,46600,"Bundled","NA"]
[null,null,null,null,46601,"Not covered","NA"]
[null,null,null,null,46604,940.67745865197276,{"$f":"VLOOKUP(E2518,'[1]Combined AA and BB'!$A$1:$C$6133,3,FALSE)","v":"Y"}]
[null,null,null,null,46606,535.86,{"$f":"VLOOKUP(E2519,'[1]Combined AA and BB'!$A$1:$C$6133,3,FALSE)","v":"Y"}]
[null,null,null,null,46607,"Not covered","NA"]
[null,null,null,null,46608,721.89252572235137,{"$f":"VLOOKUP(E2521,'[1]Combined AA and BB'!$A$1:$C$6133,3,FALSE)","v":"Y"}]
[null,null,null,null,46610,2060.0784440259408,{"$f":"VLOOKUP(E2522,'[1]Combined AA and BB'!$A$1:$C$6133,3,FALSE)","v":"Y"}]
[null,null,null,null,46611,721.89252572235137,{"$f":"VLOOKUP(E2523,'[1]Combined AA and BB'!$A$1:$C$6133,3,FALSE)","v":"Y"}]
[null,null,null,null,46612,2060.0784440259408,{"$f":"VLOOKUP(E2524,'[1]Combined AA and BB'!$A$1:$C$6133,3,FALSE)","v":"Y"}]
[null,null,null,null,46614,320.92059999999998,{"$f":"VLOOKUP(E2525,'[1]Combined AA and BB'!$A$1:$C$6133,3,FALSE)","v":"Y"}]
[null,null,null,null,46615,2060.0784440259408,{"$f":"VLOOKUP(E2526,'[1]Combined AA and BB'!$A$1:$C$6133,3,FALSE)","v":"Y"}]
[null,null,null,null,46700,2060.0784440259408,{"$f":"VLOOKUP(E2527,'[1]Combined AA and BB'!$A$1:$C$6133,3,FALSE)","v":"Y"}]
[null,null,null,null,46706,3504.5933416349458,{"$f":"VLOOKUP(E2528,'[1]Combined AA and BB'!$A$1:$C$6133,3,FALSE)","v":"Y"}]
[null,null,null,null,46707,3690.7428140461338,{"$f":"VLOOKUP(E2529,'[1]Combined AA and BB'!$A$1:$C$6133,3,FALSE)","v":"Y"}]
[null,null,null,null,46750,2060.0784440259408,{"$f":"VLOOKUP(E2530,'[1]Combined AA and BB'!$A$1:$C$6133,3,FALSE)","v":"Y"}]
[null,null,null,null,46753,2060.0784440259408,{"$f":"VLOOKUP(E2531,'[1]Combined AA and BB'!$A$1:$C$6133,3,FALSE)","v":"Y"}]
[null,null,null,null,46754,2060.0784440259408,{"$f":"VLOOKUP(E2532,'[1]Combined AA and BB'!$A$1:$C$6133,3,FALSE)","v":"Y"}]
[null,null,null,null,46760,2060.0784440259408,{"$f":"VLOOKUP(E2533,'[1]Combined AA and BB'!$A$1:$C$6133,3,FALSE)","v":"Y"}]
[null,null,null,null,46761,2060.0784440259408,{"$f":"VLOOKUP(E2534,'[1]Combined AA and BB'!$A$1:$C$6133,3,FALSE)","v":"Y"}]
[null,null,null,null,46900,"Not covered","NA"]
[null,null,null,null,46910,"Not covered","NA"]
[null,null,null,null,46916,"Not covered","NA"]
[null,null,null,null,46917,"Not covered","NA"]
[null,null,null,null,46922,"Not covered","NA"]
[null,null,null,null,46924,"Not covered","NA"]
[null,null,null,null,46930,407.25360000000001,{"$f":"VLOOKUP(E2541,'[1]Combined AA and BB'!$A$1:$C$6133,3,FALSE)","v":"Y"}]
[null,null,null,null,46940,501.32679999999999,{"$f":"VLOOKUP(E2542,'[1]Combined AA and BB'!$A$1:$C$6133,3,FALSE)","v":"Y"}]
[null,null,null,null,46942,478.10619999999994,{"$f":"VLOOKUP(E2543,'[1]Combined AA and BB'!$A$1:$C$6133,3,FALSE)","v":"Y"}]
[null,null,null,null,46945,2060.0784440259408,{"$f":"VLOOKUP(E2544,'[1]Combined AA and BB'!$A$1:$C$6133,3,FALSE)","v":"Y"}]
[null,null,null,null,46946,2060.0784440259408,{"$f":"VLOOKUP(E2545,'[1]Combined AA and BB'!$A$1:$C$6133,3,FALSE)","v":"Y"}]
[null,null,null,null,46947,2060.0784440259408,{"$f":"VLOOKUP(E2546,'[1]Combined AA and BB'!$A$1:$C$6133,3,FALSE)","v":"Y"}]
[null,null,null,null,46948,2060.0784440259408,{"$f":"VLOOKUP(E2547,'[1]Combined AA and BB'!$A$1:$C$6133,3,FALSE)","v":"Y"}]
[null,null,null,null,47000,1062.8859418079082,{"$f":"VLOOKUP(E2548,'[1]Combined AA and BB'!$A$1:$C$6133,3,FALSE)","v":"Y"}]
[null,null,null,null,47001,"Bundled","NA"]
[null,null,null,null,47382,"Not covered","NA"]
[null,null,null,null,47383,"Not covered","NA"]
[null,null,null,null,47531,"Bundled","NA"]
[null,null,null,null,47532,"Bundled","NA"]
[null,null,null,null,47533,2779.3325052928126,{"$f":"VLOOKUP(E2554,'[1]Combined AA and BB'!$A$1:$C$6133,3,FALSE)","v":"Y"}]
[null,null,null,null,47534,2779.3325052928126,{"$f":"VLOOKUP(E2555,'[1]Combined AA and BB'!$A$1:$C$6133,3,FALSE)","v":"Y"}]
[null,null,null,null,47535,2779.3325052928126,{"$f":"VLOOKUP(E2556,'[1]Combined AA and BB'!$A$1:$C$6133,3,FALSE)","v":"Y"}]
[null,null,null,null,47536,2779.3325052928126,{"$f":"VLOOKUP(E2557,'[1]Combined AA and BB'!$A$1:$C$6133,3,FALSE)","v":"Y"}]
[null,null,null,null,47537,717.08273478055889,{"$f":"VLOOKUP(E2558,'[1]Combined AA and BB'!$A$1:$C$6133,3,FALSE)","v":"N"}]
[null,null,null,null,47538,7811.9833164904303,{"$f":"VLOOKUP(E2559,'[1]Combined AA and BB'!$A$1:$C$6133,3,FALSE)","v":"Y"}]
[null,null,null,null,47539,7740.797135711442,{"$f":"VLOOKUP(E2560,'[1]Combined AA and BB'!$A$1:$C$6133,3,FALSE)","v":"Y"}]
[null,null,null,null,47540,7975.0604530463233,{"$f":"VLOOKUP(E2561,'[1]Combined AA and BB'!$A$1:$C$6133,3,FALSE)","v":"Y"}]
[null,null,null,null,47541,2779.3325052928126,{"$f":"VLOOKUP(E2562,'[1]Combined AA and BB'!$A$1:$C$6133,3,FALSE)","v":"Y"}]
[null,null,null,null,47542,"Bundled","NA"]
[null,null,null,null,47543,"Bundled","NA"]
[null,null,null,null,47544,"Bundled","NA"]
[null,null,null,null,47552,2779.3325052928126,{"$f":"VLOOKUP(E2566,'[1]Combined AA and BB'!$A$1:$C$6133,3,FALSE)","v":"Y"}]
[null,null,null,null,47553,4700.5985797499743,{"$f":"VLOOKUP(E2567,'[1]Combined AA and BB'!$A$1:$C$6133,3,FALSE)","v":"Y"}]
[null,null,null,null,47554,7182.8950786757341,{"$f":"VLOOKUP(E2568,'[1]Combined AA and BB'!$A$1:$C$6133,3,FALSE)","v":"Y"}]
[null,null,null,null,47555,4880.6925599682581,{"$f":"VLOOKUP(E2569,'[1]Combined AA and BB'!$A$1:$C$6133,3,FALSE)","v":"Y"}]
[null,null,null,null,47556,8123.0102416240807,{"$f":"VLOOKUP(E2570,'[1]Combined AA and BB'!$A$1:$C$6133,3,FALSE)","v":"Y"}]
[null,null,null,null,47562,4168.5316199700519,{"$f":"VLOOKUP(E2571,'[1]Combined AA and BB'!$A$1:$C$6133,3,FALSE)","v":"Y"}]
[null,null,null,null,47563,4168.5316199700519,{"$f":"VLOOKUP(E2572,'[1]Combined AA and BB'!$A$1:$C$6133,3,FALSE)","v":"Y"}]
[null,null,null,null,47564,4168.5316199700519,{"$f":"VLOOKUP(E2573,'[1]Combined AA and BB'!$A$1:$C$6133,3,FALSE)","v":"Y"}]
[null,null,null,null,48102,1062.8859418079082,{"$f":"VLOOKUP(E2574,'[1]Combined AA and BB'!$A$1:$C$6133,3,FALSE)","v":"Y"}]
[null,null,null,null,49082,717.08273478055889,{"$f":"VLOOKUP(E2575,'[1]Combined AA and BB'!$A$1:$C$6133,3,FALSE)","v":"Y"}]
[null,null,null,null,49083,717.08273478055889,{"$f":"VLOOKUP(E2576,'[1]Combined AA and BB'!$A$1:$C$6133,3,FALSE)","v":"Y"}]
[null,null,null,null,49084,717.08273478055889,{"$f":"VLOOKUP(E2577,'[1]Combined AA and BB'!$A$1:$C$6133,3,FALSE)","v":"Y"}]
[null,null,null,null,49180,1062.8859418079082,{"$f":"VLOOKUP(E2578,'[1]Combined AA and BB'!$A$1:$C$6133,3,FALSE)","v":"Y"}]
[null,null,null,null,49250,2779.3325052928126,{"$f":"VLOOKUP(E2579,'[1]Combined AA and BB'!$A$1:$C$6133,3,FALSE)","v":"Y"}]
[null,null,null,null,49320,4168.5316199700519,{"$f":"VLOOKUP(E2580,'[1]Combined AA and BB'!$A$1:$C$6133,3,FALSE)","v":"Y"}]
[null,null,null,null,49321,4168.5316199700519,{"$f":"VLOOKUP(E2581,'[1]Combined AA and BB'!$A$1:$C$6133,3,FALSE)","v":"Y"}]
[null,null,null,null,49322,4168.5316199700519,{"$f":"VLOOKUP(E2582,'[1]Combined AA and BB'!$A$1:$C$6133,3,FALSE)","v":"Y"}]
[null,null,null,null,49327,"Not covered","NA"]
[null,null,null,null,49400,"Bundled","NA"]
[null,null,null,null,49402,2779.3325052928126,{"$f":"VLOOKUP(E2585,'[1]Combined AA and BB'!$A$1:$C$6133,3,FALSE)","v":"Y"}]
[null,null,null,null,49407,1062.8859418079082,{"$f":"VLOOKUP(E2586,'[1]Combined AA and BB'!$A$1:$C$6133,3,FALSE)","v":"Y"}]
[null,null,null,null,49419,"Not covered","NA"]
[null,null,null,null,49421,2779.3325052928126,{"$f":"VLOOKUP(E2588,'[1]Combined AA and BB'!$A$1:$C$6133,3,FALSE)","v":"Y"}]
[null,null,null,null,49422,2408.9180478528747,{"$f":"VLOOKUP(E2589,'[1]Combined AA and BB'!$A$1:$C$6133,3,FALSE)","v":"N"}]
[null,null,null,null,49423,1255.4159907297244,{"$f":"VLOOKUP(E2590,'[1]Combined AA and BB'!$A$1:$C$6133,3,FALSE)","v":"Y"}]
[null,null,null,null,49424,"Bundled","NA"]
[null,null,null,null,49426,2779.3325052928126,{"$f":"VLOOKUP(E2592,'[1]Combined AA and BB'!$A$1:$C$6133,3,FALSE)","v":"Y"}]
[null,null,null,null,49427,"Bundled","NA"]
[null,null,null,null,49429,2408.9180478528747,{"$f":"VLOOKUP(E2594,'[1]Combined AA and BB'!$A$1:$C$6133,3,FALSE)","v":"N"}]
[null,null,null,null,49440,1255.4159907297244,{"$f":"VLOOKUP(E2595,'[1]Combined AA and BB'!$A$1:$C$6133,3,FALSE)","v":"Y"}]
[null,null,null,null,49441,1255.4159907297244,{"$f":"VLOOKUP(E2596,'[1]Combined AA and BB'!$A$1:$C$6133,3,FALSE)","v":"Y"}]
[null,null,null,null,49446,1255.4159907297244,{"$f":"VLOOKUP(E2597,'[1]Combined AA and BB'!$A$1:$C$6133,3,FALSE)","v":"Y"}]
[null,null,null,null,49450,717.08273478055889,{"$f":"VLOOKUP(E2598,'[1]Combined AA and BB'!$A$1:$C$6133,3,FALSE)","v":"Y"}]
[null,null,null,null,49451,717.08273478055889,{"$f":"VLOOKUP(E2599,'[1]Combined AA and BB'!$A$1:$C$6133,3,FALSE)","v":"Y"}]
[null,null,null,null,49452,717.08273478055889,{"$f":"VLOOKUP(E2600,'[1]Combined AA and BB'!$A$1:$C$6133,3,FALSE)","v":"Y"}]
[null,null,null,null,49460,717.08273478055889,{"$f":"VLOOKUP(E2601,'[1]Combined AA and BB'!$A$1:$C$6133,3,FALSE)","v":"Y"}]
[null,null,null,null,49465,202.85033775915127,{"$f":"VLOOKUP(E2602,'[1]Combined AA and BB'!$A$1:$C$6133,3,FALSE)","v":"N"}]
[null,null,null,null,49495,"Not covered","NA"]
[null,null,null,null,49496,"Not covered","NA"]
[null,null,null,null,49500,"Not covered","NA"]
[null,null,null,null,49501,"Not covered","NA"]
[null,null,null,null,49505,2779.3325052928126,{"$f":"VLOOKUP(E2607,'[1]Combined AA and BB'!$A$1:$C$6133,3,FALSE)","v":"Y"}]
[null,null,null,null,49507,2779.3325052928126,{"$f":"VLOOKUP(E2608,'[1]Combined AA and BB'!$A$1:$C$6133,3,FALSE)","v":"Y"}]
[null,null,null,null,49520,2779.3325052928126,{"$f":"VLOOKUP(E2609,'[1]Combined AA and BB'!$A$1:$C$6133,3,FALSE)","v":"Y"}]
[null,null,null,null,49521,2779.3325052928126,{"$f":"VLOOKUP(E2610,'[1]Combined AA and BB'!$A$1:$C$6133,3,FALSE)","v":"Y"}]
[null,null,null,null,49525,2779.3325052928126,{"$f":"VLOOKUP(E2611,'[1]Combined AA and BB'!$A$1:$C$6133,3,FALSE)","v":"Y"}]
[null,null,null,null,49540,4168.5316199700519,{"$f":"VLOOKUP(E2612,'[1]Combined AA and BB'!$A$1:$C$6133,3,FALSE)","v":"Y"}]
[null,null,null,null,49550,2779.3325052928126,{"$f":"VLOOKUP(E2613,'[1]Combined AA and BB'!$A$1:$C$6133,3,FALSE)","v":"Y"}]
[null,null,null,null,49553,2779.3325052928126,{"$f":"VLOOKUP(E2614,'[1]Combined AA and BB'!$A$1:$C$6133,3,FALSE)","v":"Y"}]
[null,null,null,null,49555,2779.3325052928126,{"$f":"VLOOKUP(E2615,'[1]Combined AA and BB'!$A$1:$C$6133,3,FALSE)","v":"Y"}]
[null,null,null,null,49557,2779.3325052928126,{"$f":"VLOOKUP(E2616,'[1]Combined AA and BB'!$A$1:$C$6133,3,FALSE)","v":"Y"}]
[null,null,null,null,49591,2779.3325052928126,{"$f":"VLOOKUP(E2617,'[1]Combined AA and BB'!$A$1:$C$6133,3,FALSE)","v":"Y"}]
[null,null,null,null,49592,4168.5316199700519,{"$f":"VLOOKUP(E2618,'[1]Combined AA and BB'!$A$1:$C$6133,3,FALSE)","v":"Y"}]
[null,null,null,null,49593,2779.3325052928126,{"$f":"VLOOKUP(E2619,'[1]Combined AA and BB'!$A$1:$C$6133,3,FALSE)","v":"Y"}]
[null,null,null,null,49594,4168.5316199700519,{"$f":"VLOOKUP(E2620,'[1]Combined AA and BB'!$A$1:$C$6133,3,FALSE)","v":"Y"}]
[null,null,null,null,49595,2779.3325052928126,{"$f":"VLOOKUP(E2621,'[1]Combined AA and BB'!$A$1:$C$6133,3,FALSE)","v":"Y"}]
[null,null,null,null,49600,2779.3325052928126,{"$f":"VLOOKUP(E2622,'[1]Combined AA and BB'!$A$1:$C$6133,3,FALSE)","v":"Y"}]
[null,null,null,null,49613,2779.3325052928126,{"$f":"VLOOKUP(E2623,'[1]Combined AA and BB'!$A$1:$C$6133,3,FALSE)","v":"Y"}]
[null,null,null,null,49614,4168.5316199700519,{"$f":"VLOOKUP(E2624,'[1]Combined AA and BB'!$A$1:$C$6133,3,FALSE)","v":"Y"}]
[null,null,null,null,49615,2779.3325052928126,{"$f":"VLOOKUP(E2625,'[1]Combined AA and BB'!$A$1:$C$6133,3,FALSE)","v":"Y"}]
[null,null,null,null,49650,4168.5316199700519,{"$f":"VLOOKUP(E2626,'[1]Combined AA and BB'!$A$1:$C$6133,3,FALSE)","v":"Y"}]
[null,null,null,null,49651,4168.5316199700519,{"$f":"VLOOKUP(E2627,'[1]Combined AA and BB'!$A$1:$C$6133,3,FALSE)","v":"Y"}]
[null,null,null,null,50200,1062.8859418079082,{"$f":"VLOOKUP(E2628,'[1]Combined AA and BB'!$A$1:$C$6133,3,FALSE)","v":"Y"}]
[null,null,null,null,50382,1414.7446410281614,{"$f":"VLOOKUP(E2629,'[1]Combined AA and BB'!$A$1:$C$6133,3,FALSE)","v":"Y"}]
[null,null,null,null,50384,1414.7446410281614,{"$f":"VLOOKUP(E2630,'[1]Combined AA and BB'!$A$1:$C$6133,3,FALSE)","v":"N"}]
[null,null,null,null,50385,1414.7446410281614,{"$f":"VLOOKUP(E2631,'[1]Combined AA and BB'!$A$1:$C$6133,3,FALSE)","v":"Y"}]
[null,null,null,null,50386,1431.3416,{"$f":"VLOOKUP(E2632,'[1]Combined AA and BB'!$A$1:$C$6133,3,FALSE)","v":"N"}]
[null,null,null,null,50387,1414.7446410281614,{"$f":"VLOOKUP(E2633,'[1]Combined AA and BB'!$A$1:$C$6133,3,FALSE)","v":"Y"}]
[null,null,null,null,50389,471.86990378047778,{"$f":"VLOOKUP(E2634,'[1]Combined AA and BB'!$A$1:$C$6133,3,FALSE)","v":"N"}]
[null,null,null,null,50390,563.74037104996432,{"$f":"VLOOKUP(E2635,'[1]Combined AA and BB'!$A$1:$C$6133,3,FALSE)","v":"Y"}]
[null,null,null,null,50391,225.6566,{"$f":"VLOOKUP(E2636,'[1]Combined AA and BB'!$A$1:$C$6133,3,FALSE)","v":"Y"}]
[null,null,null,null,50396,471.86990378047778,{"$f":"VLOOKUP(E2637,'[1]Combined AA and BB'!$A$1:$C$6133,3,FALSE)","v":"Y"}]
[null,null,null,null,50430,"Bundled","NA"]
[null,null,null,null,50431,"Bundled","NA"]
[null,null,null,null,50432,1414.7446410281614,{"$f":"VLOOKUP(E2640,'[1]Combined AA and BB'!$A$1:$C$6133,3,FALSE)","v":"Y"}]
[null,null,null,null,50433,2496.688081837452,{"$f":"VLOOKUP(E2641,'[1]Combined AA and BB'!$A$1:$C$6133,3,FALSE)","v":"Y"}]
[null,null,null,null,50434,2383.4735981385566,{"$f":"VLOOKUP(E2642,'[1]Combined AA and BB'!$A$1:$C$6133,3,FALSE)","v":"Y"}]
[null,null,null,null,50435,1414.7446410281614,{"$f":"VLOOKUP(E2643,'[1]Combined AA and BB'!$A$1:$C$6133,3,FALSE)","v":"Y"}]
[null,null,null,null,50436,2496.688081837452,{"$f":"VLOOKUP(E2644,'[1]Combined AA and BB'!$A$1:$C$6133,3,FALSE)","v":"Y"}]
[null,null,null,null,50437,2496.688081837452,{"$f":"VLOOKUP(E2645,'[1]Combined AA and BB'!$A$1:$C$6133,3,FALSE)","v":"Y"}]
[null,null,null,null,50551,3776.4644525889162,{"$f":"VLOOKUP(E2646,'[1]Combined AA and BB'!$A$1:$C$6133,3,FALSE)","v":"Y"}]
[null,null,null,null,50553,7366.3355151058859,{"$f":"VLOOKUP(E2647,'[1]Combined AA and BB'!$A$1:$C$6133,3,FALSE)","v":"Y"}]
[null,null,null,null,50555,7141.8820951235084,{"$f":"VLOOKUP(E2648,'[1]Combined AA and BB'!$A$1:$C$6133,3,FALSE)","v":"Y"}]
[null,null,null,null,50557,7141.8820951235084,{"$f":"VLOOKUP(E2649,'[1]Combined AA and BB'!$A$1:$C$6133,3,FALSE)","v":"Y"}]
[null,null,null,null,50561,3776.4644525889162,{"$f":"VLOOKUP(E2650,'[1]Combined AA and BB'!$A$1:$C$6133,3,FALSE)","v":"Y"}]
[null,null,null,null,50562,"Not covered","NA"]
[null,null,null,null,50570,4222.5447891300964,{"$f":"VLOOKUP(E2652,'[1]Combined AA and BB'!$A$1:$C$6133,3,FALSE)","v":"Y"}]
[null,null,null,null,50572,471.86990378047778,{"$f":"VLOOKUP(E2653,'[1]Combined AA and BB'!$A$1:$C$6133,3,FALSE)","v":"Y"}]
[null,null,null,null,50574,2496.688081837452,{"$f":"VLOOKUP(E2654,'[1]Combined AA and BB'!$A$1:$C$6133,3,FALSE)","v":"Y"}]
[null,null,null,null,50575,3776.4644525889162,{"$f":"VLOOKUP(E2655,'[1]Combined AA and BB'!$A$1:$C$6133,3,FALSE)","v":"Y"}]
[null,null,null,null,50576,7141.8820951235084,{"$f":"VLOOKUP(E2656,'[1]Combined AA and BB'!$A$1:$C$6133,3,FALSE)","v":"Y"}]
[null,null,null,null,50580,3776.4644525889162,{"$f":"VLOOKUP(E2657,'[1]Combined AA and BB'!$A$1:$C$6133,3,FALSE)","v":"Y"}]
[null,null,null,null,50590,2496.688081837452,{"$f":"VLOOKUP(E2658,'[1]Combined AA and BB'!$A$1:$C$6133,3,FALSE)","v":"Y"}]
[null,null,null,null,50592,"Not covered","NA"]
[null,null,null,null,50606,"Bundled","NA"]
[null,null,null,null,50684,"Bundled","NA"]
[null,null,null,null,50686,126.32621784711014,{"$f":"VLOOKUP(E2662,'[1]Combined AA and BB'!$A$1:$C$6133,3,FALSE)","v":"N"}]
[null,null,null,null,50688,1414.7446410281614,{"$f":"VLOOKUP(E2663,'[1]Combined AA and BB'!$A$1:$C$6133,3,FALSE)","v":"Y"}]
[null,null,null,null,50690,"Bundled","NA"]
[null,null,null,null,50693,2496.688081837452,{"$f":"VLOOKUP(E2665,'[1]Combined AA and BB'!$A$1:$C$6133,3,FALSE)","v":"Y"}]
[null,null,null,null,50694,2496.688081837452,{"$f":"VLOOKUP(E2666,'[1]Combined AA and BB'!$A$1:$C$6133,3,FALSE)","v":"Y"}]
[null,null,null,null,50695,2496.688081837452,{"$f":"VLOOKUP(E2667,'[1]Combined AA and BB'!$A$1:$C$6133,3,FALSE)","v":"Y"}]
[null,null,null,null,50705,"Bundled","NA"]
[null,null,null,null,50706,"Bundled","NA"]
[null,null,null,null,50947,4168.5316199700519,{"$f":"VLOOKUP(E2670,'[1]Combined AA and BB'!$A$1:$C$6133,3,FALSE)","v":"Y"}]
[null,null,null,null,50948,7140.4028248878139,{"$f":"VLOOKUP(E2671,'[1]Combined AA and BB'!$A$1:$C$6133,3,FALSE)","v":"Y"}]
[null,null,null,null,50951,2496.688081837452,{"$f":"VLOOKUP(E2672,'[1]Combined AA and BB'!$A$1:$C$6133,3,FALSE)","v":"Y"}]
[null,null,null,null,50953,2496.688081837452,{"$f":"VLOOKUP(E2673,'[1]Combined AA and BB'!$A$1:$C$6133,3,FALSE)","v":"Y"}]
[null,null,null,null,50955,3776.4644525889162,{"$f":"VLOOKUP(E2674,'[1]Combined AA and BB'!$A$1:$C$6133,3,FALSE)","v":"Y"}]
[null,null,null,null,50957,3776.4644525889162,{"$f":"VLOOKUP(E2675,'[1]Combined AA and BB'!$A$1:$C$6133,3,FALSE)","v":"Y"}]
[null,null,null,null,50961,3776.4644525889162,{"$f":"VLOOKUP(E2676,'[1]Combined AA and BB'!$A$1:$C$6133,3,FALSE)","v":"Y"}]
[null,null,null,null,50970,2496.688081837452,{"$f":"VLOOKUP(E2677,'[1]Combined AA and BB'!$A$1:$C$6133,3,FALSE)","v":"Y"}]
[null,null,null,null,50972,2496.688081837452,{"$f":"VLOOKUP(E2678,'[1]Combined AA and BB'!$A$1:$C$6133,3,FALSE)","v":"Y"}]
[null,null,null,null,50974,3776.4644525889162,{"$f":"VLOOKUP(E2679,'[1]Combined AA and BB'!$A$1:$C$6133,3,FALSE)","v":"Y"}]
[null,null,null,null,50976,3776.4644525889162,{"$f":"VLOOKUP(E2680,'[1]Combined AA and BB'!$A$1:$C$6133,3,FALSE)","v":"Y"}]
[null,null,null,null,50980,3776.4644525889162,{"$f":"VLOOKUP(E2681,'[1]Combined AA and BB'!$A$1:$C$6133,3,FALSE)","v":"Y"}]
[null,null,null,null,51020,2496.688081837452,{"$f":"VLOOKUP(E2682,'[1]Combined AA and BB'!$A$1:$C$6133,3,FALSE)","v":"Y"}]
[null,null,null,null,51030,2496.688081837452,{"$f":"VLOOKUP(E2683,'[1]Combined AA and BB'!$A$1:$C$6133,3,FALSE)","v":"Y"}]
[null,null,null,null,51040,1414.7446410281614,{"$f":"VLOOKUP(E2684,'[1]Combined AA and BB'!$A$1:$C$6133,3,FALSE)","v":"Y"}]
[null,null,null,null,51045,1414.7446410281614,{"$f":"VLOOKUP(E2685,'[1]Combined AA and BB'!$A$1:$C$6133,3,FALSE)","v":"Y"}]
[null,null,null,null,51050,"Not covered","NA"]
[null,null,null,null,51065,"Not covered","NA"]
[null,null,null,null,51080,1789.2422303467429,{"$f":"VLOOKUP(E2688,'[1]Combined AA and BB'!$A$1:$C$6133,3,FALSE)","v":"Y"}]
[null,null,null,null,51100,135.75119999999998,{"$f":"VLOOKUP(E2689,'[1]Combined AA and BB'!$A$1:$C$6133,3,FALSE)","v":"Y"}]
[null,null,null,null,51101,291.1506,{"$f":"VLOOKUP(E2690,'[1]Combined AA and BB'!$A$1:$C$6133,3,FALSE)","v":"N"}]
[null,null,null,null,51102,1414.7446410281614,{"$f":"VLOOKUP(E2691,'[1]Combined AA and BB'!$A$1:$C$6133,3,FALSE)","v":"Y"}]
[null,null,null,null,51500,4168.5316199700519,{"$f":"VLOOKUP(E2692,'[1]Combined AA and BB'!$A$1:$C$6133,3,FALSE)","v":"Y"}]
[null,null,null,null,51520,2496.688081837452,{"$f":"VLOOKUP(E2693,'[1]Combined AA and BB'!$A$1:$C$6133,3,FALSE)","v":"Y"}]
[null,null,null,null,51600,"Bundled","NA"]
[null,null,null,null,51605,"Bundled","NA"]
[null,null,null,null,51610,"Bundled","NA"]
[null,null,null,null,51700,142.89599999999999,{"$f":"VLOOKUP(E2697,'[1]Combined AA and BB'!$A$1:$C$6133,3,FALSE)","v":"Y"}]
[null,null,null,null,51701,"Bundled","NA"]
[null,null,null,null,51702,"Bundled","NA"]
[null,null,null,null,51703,126.32621784711014,{"$f":"VLOOKUP(E2700,'[1]Combined AA and BB'!$A$1:$C$6133,3,FALSE)","v":"N"}]
[null,null,null,null,51705,181.0016,{"$f":"VLOOKUP(E2701,'[1]Combined AA and BB'!$A$1:$C$6133,3,FALSE)","v":"Y"}]
[null,null,null,null,51710,471.86990378047778,{"$f":"VLOOKUP(E2702,'[1]Combined AA and BB'!$A$1:$C$6133,3,FALSE)","v":"Y"}]
[null,null,null,null,51715,4480.2105349398098,{"$f":"VLOOKUP(E2703,'[1]Combined AA and BB'!$A$1:$C$6133,3,FALSE)","v":"Y"}]
[null,null,null,null,51720,"Not covered","NA"]
[null,null,null,null,51725,186.64757079156672,{"$f":"VLOOKUP(E2705,'[1]Combined AA and BB'!$A$1:$C$6133,3,FALSE)","v":"Y"}]
[null,null,null,null,51726,186.64757079156672,{"$f":"VLOOKUP(E2706,'[1]Combined AA and BB'!$A$1:$C$6133,3,FALSE)","v":"Y"}]
[null,null,null,null,51727,691.85479999999995,{"$f":"VLOOKUP(E2707,'[1]Combined AA and BB'!$A$1:$C$6133,3,FALSE)","v":"Y"}]
[null,null,null,null,51728,690.06859999999995,{"$f":"VLOOKUP(E2708,'[1]Combined AA and BB'!$A$1:$C$6133,3,FALSE)","v":"Y"}]
[null,null,null,null,51729,728.76959999999997,{"$f":"VLOOKUP(E2709,'[1]Combined AA and BB'!$A$1:$C$6133,3,FALSE)","v":"Y"}]
[null,null,null,null,51736,"Bundled","NA"]
[null,null,null,null,51741,"Bundled","NA"]
[null,null,null,null,51784,118.4846,{"$f":"VLOOKUP(E2712,'[1]Combined AA and BB'!$A$1:$C$6133,3,FALSE)","v":"N"}]
[null,null,null,null,51785,186.64757079156672,{"$f":"VLOOKUP(E2713,'[1]Combined AA and BB'!$A$1:$C$6133,3,FALSE)","v":"Y"}]
[null,null,null,null,51792,"Bundled","NA"]
[null,null,null,null,51797,"Bundled","NA"]
[null,null,null,null,51798,"Bundled","NA"]
[null,null,null,null,51880,2496.688081837452,{"$f":"VLOOKUP(E2717,'[1]Combined AA and BB'!$A$1:$C$6133,3,FALSE)","v":"Y"}]
[null,null,null,null,51992,7712.0221652910241,{"$f":"VLOOKUP(E2718,'[1]Combined AA and BB'!$A$1:$C$6133,3,FALSE)","v":"Y"}]
[null,null,null,null,52000,471.86990378047778,{"$f":"VLOOKUP(E2719,'[1]Combined AA and BB'!$A$1:$C$6133,3,FALSE)","v":"Y"}]
[null,null,null,null,52001,2496.688081837452,{"$f":"VLOOKUP(E2720,'[1]Combined AA and BB'!$A$1:$C$6133,3,FALSE)","v":"Y"}]
[null,null,null,null,52005,1414.7446410281614,{"$f":"VLOOKUP(E2721,'[1]Combined AA and BB'!$A$1:$C$6133,3,FALSE)","v":"Y"}]
[null,null,null,null,52007,2496.688081837452,{"$f":"VLOOKUP(E2722,'[1]Combined AA and BB'!$A$1:$C$6133,3,FALSE)","v":"Y"}]
[null,null,null,null,52010,471.86990378047778,{"$f":"VLOOKUP(E2723,'[1]Combined AA and BB'!$A$1:$C$6133,3,FALSE)","v":"Y"}]
[null,null,null,null,52204,1414.7446410281614,{"$f":"VLOOKUP(E2724,'[1]Combined AA and BB'!$A$1:$C$6133,3,FALSE)","v":"Y"}]
[null,null,null,null,52214,2496.688081837452,{"$f":"VLOOKUP(E2725,'[1]Combined AA and BB'!$A$1:$C$6133,3,FALSE)","v":"Y"}]
[null,null,null,null,52224,2496.688081837452,{"$f":"VLOOKUP(E2726,'[1]Combined AA and BB'!$A$1:$C$6133,3,FALSE)","v":"Y"}]
[null,null,null,null,52234,2496.688081837452,{"$f":"VLOOKUP(E2727,'[1]Combined AA and BB'!$A$1:$C$6133,3,FALSE)","v":"Y"}]
[null,null,null,null,52235,2496.688081837452,{"$f":"VLOOKUP(E2728,'[1]Combined AA and BB'!$A$1:$C$6133,3,FALSE)","v":"Y"}]
[null,null,null,null,52240,3776.4644525889162,{"$f":"VLOOKUP(E2729,'[1]Combined AA and BB'!$A$1:$C$6133,3,FALSE)","v":"Y"}]
[null,null,null,null,52250,"Not covered","NA"]
[null,null,null,null,52260,1414.7446410281614,{"$f":"VLOOKUP(E2731,'[1]Combined AA and BB'!$A$1:$C$6133,3,FALSE)","v":"Y"}]
[null,null,null,null,52265,703.16740000000004,{"$f":"VLOOKUP(E2732,'[1]Combined AA and BB'!$A$1:$C$6133,3,FALSE)","v":"Y"}]
[null,null,null,null,52270,1414.7446410281614,{"$f":"VLOOKUP(E2733,'[1]Combined AA and BB'!$A$1:$C$6133,3,FALSE)","v":"Y"}]
[null,null,null,null,52275,1414.7446410281614,{"$f":"VLOOKUP(E2734,'[1]Combined AA and BB'!$A$1:$C$6133,3,FALSE)","v":"Y"}]
[null,null,null,null,52276,1414.7446410281614,{"$f":"VLOOKUP(E2735,'[1]Combined AA and BB'!$A$1:$C$6133,3,FALSE)","v":"Y"}]
[null,null,null,null,52277,2496.688081837452,{"$f":"VLOOKUP(E2736,'[1]Combined AA and BB'!$A$1:$C$6133,3,FALSE)","v":"Y"}]
[null,null,null,null,52281,1414.7446410281614,{"$f":"VLOOKUP(E2737,'[1]Combined AA and BB'!$A$1:$C$6133,3,FALSE)","v":"Y"}]
[null,null,null,null,52282,2496.688081837452,{"$f":"VLOOKUP(E2738,'[1]Combined AA and BB'!$A$1:$C$6133,3,FALSE)","v":"Y"}]
[null,null,null,null,52283,1414.7446410281614,{"$f":"VLOOKUP(E2739,'[1]Combined AA and BB'!$A$1:$C$6133,3,FALSE)","v":"Y"}]
[null,null,null,null,52285,471.86990378047778,{"$f":"VLOOKUP(E2740,'[1]Combined AA and BB'!$A$1:$C$6133,3,FALSE)","v":"Y"}]
[null,null,null,null,52287,1414.7446410281614,{"$f":"VLOOKUP(E2741,'[1]Combined AA and BB'!$A$1:$C$6133,3,FALSE)","v":"Y"}]
[null,null,null,null,52290,1414.7446410281614,{"$f":"VLOOKUP(E2742,'[1]Combined AA and BB'!$A$1:$C$6133,3,FALSE)","v":"Y"}]
[null,null,null,null,52300,2496.688081837452,{"$f":"VLOOKUP(E2743,'[1]Combined AA and BB'!$A$1:$C$6133,3,FALSE)","v":"Y"}]
[null,null,null,null,52301,2496.688081837452,{"$f":"VLOOKUP(E2744,'[1]Combined AA and BB'!$A$1:$C$6133,3,FALSE)","v":"Y"}]
[null,null,null,null,52305,3776.4644525889162,{"$f":"VLOOKUP(E2745,'[1]Combined AA and BB'!$A$1:$C$6133,3,FALSE)","v":"Y"}]
[null,null,null,null,52310,1414.7446410281614,{"$f":"VLOOKUP(E2746,'[1]Combined AA and BB'!$A$1:$C$6133,3,FALSE)","v":"Y"}]
[null,null,null,null,52315,1414.7446410281614,{"$f":"VLOOKUP(E2747,'[1]Combined AA and BB'!$A$1:$C$6133,3,FALSE)","v":"Y"}]
[null,null,null,null,52317,2496.688081837452,{"$f":"VLOOKUP(E2748,'[1]Combined AA and BB'!$A$1:$C$6133,3,FALSE)","v":"Y"}]
[null,null,null,null,52318,2496.688081837452,{"$f":"VLOOKUP(E2749,'[1]Combined AA and BB'!$A$1:$C$6133,3,FALSE)","v":"Y"}]
[null,null,null,null,52320,2496.688081837452,{"$f":"VLOOKUP(E2750,'[1]Combined AA and BB'!$A$1:$C$6133,3,FALSE)","v":"Y"}]
[null,null,null,null,52325,3776.4644525889162,{"$f":"VLOOKUP(E2751,'[1]Combined AA and BB'!$A$1:$C$6133,3,FALSE)","v":"Y"}]
[null,null,null,null,52327,7041.5699074969816,{"$f":"VLOOKUP(E2752,'[1]Combined AA and BB'!$A$1:$C$6133,3,FALSE)","v":"Y"}]
[null,null,null,null,52330,2496.688081837452,{"$f":"VLOOKUP(E2753,'[1]Combined AA and BB'!$A$1:$C$6133,3,FALSE)","v":"Y"}]
[null,null,null,null,52332,2496.688081837452,{"$f":"VLOOKUP(E2754,'[1]Combined AA and BB'!$A$1:$C$6133,3,FALSE)","v":"Y"}]
[null,null,null,null,52334,2496.688081837452,{"$f":"VLOOKUP(E2755,'[1]Combined AA and BB'!$A$1:$C$6133,3,FALSE)","v":"Y"}]
[null,null,null,null,52341,2496.688081837452,{"$f":"VLOOKUP(E2756,'[1]Combined AA and BB'!$A$1:$C$6133,3,FALSE)","v":"Y"}]
[null,null,null,null,52342,2496.688081837452,{"$f":"VLOOKUP(E2757,'[1]Combined AA and BB'!$A$1:$C$6133,3,FALSE)","v":"Y"}]
[null,null,null,null,52343,2496.688081837452,{"$f":"VLOOKUP(E2758,'[1]Combined AA and BB'!$A$1:$C$6133,3,FALSE)","v":"Y"}]
[null,null,null,null,52344,2496.688081837452,{"$f":"VLOOKUP(E2759,'[1]Combined AA and BB'!$A$1:$C$6133,3,FALSE)","v":"Y"}]
[null,null,null,null,52345,2496.688081837452,{"$f":"VLOOKUP(E2760,'[1]Combined AA and BB'!$A$1:$C$6133,3,FALSE)","v":"Y"}]
[null,null,null,null,52346,3776.4644525889162,{"$f":"VLOOKUP(E2761,'[1]Combined AA and BB'!$A$1:$C$6133,3,FALSE)","v":"Y"}]
[null,null,null,null,52351,2496.688081837452,{"$f":"VLOOKUP(E2762,'[1]Combined AA and BB'!$A$1:$C$6133,3,FALSE)","v":"Y"}]
[null,null,null,null,52352,2496.688081837452,{"$f":"VLOOKUP(E2763,'[1]Combined AA and BB'!$A$1:$C$6133,3,FALSE)","v":"Y"}]
[null,null,null,null,52353,3776.4644525889162,{"$f":"VLOOKUP(E2764,'[1]Combined AA and BB'!$A$1:$C$6133,3,FALSE)","v":"Y"}]
[null,null,null,null,52354,3776.4644525889162,{"$f":"VLOOKUP(E2765,'[1]Combined AA and BB'!$A$1:$C$6133,3,FALSE)","v":"Y"}]
[null,null,null,null,52355,"Not covered","NA"]
[null,null,null,null,52356,3776.4644525889162,{"$f":"VLOOKUP(E2767,'[1]Combined AA and BB'!$A$1:$C$6133,3,FALSE)","v":"Y"}]
[null,null,null,null,52400,2496.688081837452,{"$f":"VLOOKUP(E2768,'[1]Combined AA and BB'!$A$1:$C$6133,3,FALSE)","v":"Y"}]
[null,null,null,null,52402,2496.688081837452,{"$f":"VLOOKUP(E2769,'[1]Combined AA and BB'!$A$1:$C$6133,3,FALSE)","v":"Y"}]
[null,null,null,null,52450,2496.688081837452,{"$f":"VLOOKUP(E2770,'[1]Combined AA and BB'!$A$1:$C$6133,3,FALSE)","v":"Y"}]
[null,null,null,null,52500,2496.688081837452,{"$f":"VLOOKUP(E2771,'[1]Combined AA and BB'!$A$1:$C$6133,3,FALSE)","v":"Y"}]
[null,null,null,null,52601,3776.4644525889162,{"$f":"VLOOKUP(E2772,'[1]Combined AA and BB'!$A$1:$C$6133,3,FALSE)","v":"Y"}]
[null,null,null,null,52630,3776.4644525889162,{"$f":"VLOOKUP(E2773,'[1]Combined AA and BB'!$A$1:$C$6133,3,FALSE)","v":"Y"}]
[null,null,null,null,52640,2496.688081837452,{"$f":"VLOOKUP(E2774,'[1]Combined AA and BB'!$A$1:$C$6133,3,FALSE)","v":"Y"}]
[null,null,null,null,52647,3776.4644525889162,{"$f":"VLOOKUP(E2775,'[1]Combined AA and BB'!$A$1:$C$6133,3,FALSE)","v":"Y"}]
[null,null,null,null,52648,3776.4644525889162,{"$f":"VLOOKUP(E2776,'[1]Combined AA and BB'!$A$1:$C$6133,3,FALSE)","v":"Y"}]
[null,null,null,null,52700,2496.688081837452,{"$f":"VLOOKUP(E2777,'[1]Combined AA and BB'!$A$1:$C$6133,3,FALSE)","v":"Y"}]
[null,null,null,null,53000,1414.7446410281614,{"$f":"VLOOKUP(E2778,'[1]Combined AA and BB'!$A$1:$C$6133,3,FALSE)","v":"Y"}]
[null,null,null,null,53010,3776.4644525889162,{"$f":"VLOOKUP(E2779,'[1]Combined AA and BB'!$A$1:$C$6133,3,FALSE)","v":"Y"}]
[null,null,null,null,53020,1414.7446410281614,{"$f":"VLOOKUP(E2780,'[1]Combined AA and BB'!$A$1:$C$6133,3,FALSE)","v":"Y"}]
[null,null,null,null,53025,"Not covered","NA"]
[null,null,null,null,53040,2496.688081837452,{"$f":"VLOOKUP(E2782,'[1]Combined AA and BB'!$A$1:$C$6133,3,FALSE)","v":"Y"}]
[null,null,null,null,53060,346.52280000000002,{"$f":"VLOOKUP(E2783,'[1]Combined AA and BB'!$A$1:$C$6133,3,FALSE)","v":"Y"}]
[null,null,null,null,53080,471.86990378047778,{"$f":"VLOOKUP(E2784,'[1]Combined AA and BB'!$A$1:$C$6133,3,FALSE)","v":"Y"}]
[null,null,null,null,53085,1414.7446410281614,{"$f":"VLOOKUP(E2785,'[1]Combined AA and BB'!$A$1:$C$6133,3,FALSE)","v":"Y"}]
[null,null,null,null,53200,1414.7446410281614,{"$f":"VLOOKUP(E2786,'[1]Combined AA and BB'!$A$1:$C$6133,3,FALSE)","v":"Y"}]
[null,null,null,null,53210,"Not covered","NA"]
[null,null,null,null,53215,"Not covered","NA"]
[null,null,null,null,53220,"Not covered","NA"]
[null,null,null,null,53230,3776.4644525889162,{"$f":"VLOOKUP(E2790,'[1]Combined AA and BB'!$A$1:$C$6133,3,FALSE)","v":"Y"}]
[null,null,null,null,53235,3776.4644525889162,{"$f":"VLOOKUP(E2791,'[1]Combined AA and BB'!$A$1:$C$6133,3,FALSE)","v":"Y"}]
[null,null,null,null,53240,2496.688081837452,{"$f":"VLOOKUP(E2792,'[1]Combined AA and BB'!$A$1:$C$6133,3,FALSE)","v":"Y"}]
[null,null,null,null,53250,2496.688081837452,{"$f":"VLOOKUP(E2793,'[1]Combined AA and BB'!$A$1:$C$6133,3,FALSE)","v":"Y"}]
[null,null,null,null,53260,"Not covered","NA"]
[null,null,null,null,53265,"Not covered","NA"]
[null,null,null,null,53270,"Not covered","NA"]
[null,null,null,null,53275,"Not covered","NA"]
[null,null,null,null,53400,3776.4644525889162,{"$f":"VLOOKUP(E2798,'[1]Combined AA and BB'!$A$1:$C$6133,3,FALSE)","v":"Y"}]
[null,null,null,null,53405,3776.4644525889162,{"$f":"VLOOKUP(E2799,'[1]Combined AA and BB'!$A$1:$C$6133,3,FALSE)","v":"Y"}]
[null,null,null,null,53410,3776.4644525889162,{"$f":"VLOOKUP(E2800,'[1]Combined AA and BB'!$A$1:$C$6133,3,FALSE)","v":"Y"}]
[null,null,null,null,53420,3776.4644525889162,{"$f":"VLOOKUP(E2801,'[1]Combined AA and BB'!$A$1:$C$6133,3,FALSE)","v":"Y"}]
[null,null,null,null,53425,3776.4644525889162,{"$f":"VLOOKUP(E2802,'[1]Combined AA and BB'!$A$1:$C$6133,3,FALSE)","v":"Y"}]
[null,null,null,null,53430,3776.4644525889162,{"$f":"VLOOKUP(E2803,'[1]Combined AA and BB'!$A$1:$C$6133,3,FALSE)","v":"Y"}]
[null,null,null,null,53431,3776.4644525889162,{"$f":"VLOOKUP(E2804,'[1]Combined AA and BB'!$A$1:$C$6133,3,FALSE)","v":"Y"}]
[null,null,null,null,53440,21269.017109749664,{"$f":"VLOOKUP(E2805,'[1]Combined AA and BB'!$A$1:$C$6133,3,FALSE)","v":"Y"}]
[null,null,null,null,53442,3776.4644525889162,{"$f":"VLOOKUP(E2806,'[1]Combined AA and BB'!$A$1:$C$6133,3,FALSE)","v":"Y"}]
[null,null,null,null,53444,35724.911169730876,{"$f":"VLOOKUP(E2807,'[1]Combined AA and BB'!$A$1:$C$6133,3,FALSE)","v":"Y"}]
[null,null,null,null,53445,36596.048357699903,{"$f":"VLOOKUP(E2808,'[1]Combined AA and BB'!$A$1:$C$6133,3,FALSE)","v":"Y"}]
[null,null,null,null,53446,3776.4644525889162,{"$f":"VLOOKUP(E2809,'[1]Combined AA and BB'!$A$1:$C$6133,3,FALSE)","v":"N"}]
[null,null,null,null,53447,35928.111633316832,{"$f":"VLOOKUP(E2810,'[1]Combined AA and BB'!$A$1:$C$6133,3,FALSE)","v":"Y"}]
[null,null,null,null,53449,7141.8820951235084,{"$f":"VLOOKUP(E2811,'[1]Combined AA and BB'!$A$1:$C$6133,3,FALSE)","v":"Y"}]
[null,null,null,null,53450,2496.688081837452,{"$f":"VLOOKUP(E2812,'[1]Combined AA and BB'!$A$1:$C$6133,3,FALSE)","v":"Y"}]
[null,null,null,null,53451,22840.656366394811,{"$f":"VLOOKUP(E2813,'[1]Combined AA and BB'!$A$1:$C$6133,3,FALSE)","v":"Y"}]
[null,null,null,null,53452,15383.260818312927,{"$f":"VLOOKUP(E2814,'[1]Combined AA and BB'!$A$1:$C$6133,3,FALSE)","v":"Y"}]
[null,null,null,null,53453,2496.688081837452,{"$f":"VLOOKUP(E2815,'[1]Combined AA and BB'!$A$1:$C$6133,3,FALSE)","v":"Y"}]
[null,null,null,null,53454,186.64757079156672,{"$f":"VLOOKUP(E2816,'[1]Combined AA and BB'!$A$1:$C$6133,3,FALSE)","v":"Y"}]
[null,null,null,null,53460,2496.688081837452,{"$f":"VLOOKUP(E2817,'[1]Combined AA and BB'!$A$1:$C$6133,3,FALSE)","v":"Y"}]
[null,null,null,null,53502,2496.688081837452,{"$f":"VLOOKUP(E2818,'[1]Combined AA and BB'!$A$1:$C$6133,3,FALSE)","v":"Y"}]
[null,null,null,null,53505,3776.4644525889162,{"$f":"VLOOKUP(E2819,'[1]Combined AA and BB'!$A$1:$C$6133,3,FALSE)","v":"Y"}]
[null,null,null,null,53510,3776.4644525889162,{"$f":"VLOOKUP(E2820,'[1]Combined AA and BB'!$A$1:$C$6133,3,FALSE)","v":"Y"}]
[null,null,null,null,53515,3776.4644525889162,{"$f":"VLOOKUP(E2821,'[1]Combined AA and BB'!$A$1:$C$6133,3,FALSE)","v":"Y"}]
[null,null,null,null,53520,3776.4644525889162,{"$f":"VLOOKUP(E2822,'[1]Combined AA and BB'!$A$1:$C$6133,3,FALSE)","v":"Y"}]
[null,null,null,null,53600,162.54419999999999,{"$f":"VLOOKUP(E2823,'[1]Combined AA and BB'!$A$1:$C$6133,3,FALSE)","v":"Y"}]
[null,null,null,null,53601,"Bundled","NA"]
[null,null,null,null,53605,2496.688081837452,{"$f":"VLOOKUP(E2825,'[1]Combined AA and BB'!$A$1:$C$6133,3,FALSE)","v":"Y"}]
[null,null,null,null,53620,317.34820000000002,{"$f":"VLOOKUP(E2826,'[1]Combined AA and BB'!$A$1:$C$6133,3,FALSE)","v":"Y"}]
[null,null,null,null,53621,304.84480000000002,{"$f":"VLOOKUP(E2827,'[1]Combined AA and BB'!$A$1:$C$6133,3,FALSE)","v":"Y"}]
[null,null,null,null,53660,140.51439999999999,{"$f":"VLOOKUP(E2828,'[1]Combined AA and BB'!$A$1:$C$6133,3,FALSE)","v":"N"}]
[null,null,null,null,53661,"Bundled","NA"]
[null,null,null,null,53665,1414.7446410281614,{"$f":"VLOOKUP(E2830,'[1]Combined AA and BB'!$A$1:$C$6133,3,FALSE)","v":"Y"}]
[null,null,null,null,53850,"Not covered","NA"]
[null,null,null,null,53852,"Not covered","NA"]
[null,null,null,null,53854,3191.94,{"$f":"VLOOKUP(E2833,'[1]Combined AA and BB'!$A$1:$C$6133,3,FALSE)","v":"Y"}]
[null,null,null,null,53860,"Not covered","NA"]
[null,null,null,null,54000,"Not covered","NA"]
[null,null,null,null,54001,"Not covered","NA"]
[null,null,null,null,54015,1062.8859418079082,{"$f":"VLOOKUP(E2837,'[1]Combined AA and BB'!$A$1:$C$6133,3,FALSE)","v":"Y"}]
[null,null,null,null,54050,"Bundled","NA"]
[null,null,null,null,54055,256.61739999999998,{"$f":"VLOOKUP(E2839,'[1]Combined AA and BB'!$A$1:$C$6133,3,FALSE)","v":"Y"}]
[null,null,null,null,54056,"Bundled","NA"]
[null,null,null,null,54057,1499.1841543066416,{"$f":"VLOOKUP(E2841,'[1]Combined AA and BB'!$A$1:$C$6133,3,FALSE)","v":"Y"}]
[null,null,null,null,54060,1499.1841543066416,{"$f":"VLOOKUP(E2842,'[1]Combined AA and BB'!$A$1:$C$6133,3,FALSE)","v":"Y"}]
[null,null,null,null,54065,1499.1841543066416,{"$f":"VLOOKUP(E2843,'[1]Combined AA and BB'!$A$1:$C$6133,3,FALSE)","v":"Y"}]
[null,null,null,null,54100,1062.8859418079082,{"$f":"VLOOKUP(E2844,'[1]Combined AA and BB'!$A$1:$C$6133,3,FALSE)","v":"Y"}]
[null,null,null,null,54105,1789.2422303467429,{"$f":"VLOOKUP(E2845,'[1]Combined AA and BB'!$A$1:$C$6133,3,FALSE)","v":"Y"}]
[null,null,null,null,54110,"Not covered","NA"]
[null,null,null,null,54111,"Not covered","NA"]
[null,null,null,null,54112,"Not covered","NA"]
[null,null,null,null,54115,1789.2422303467429,{"$f":"VLOOKUP(E2849,'[1]Combined AA and BB'!$A$1:$C$6133,3,FALSE)","v":"Y"}]
[null,null,null,null,54120,2496.688081837452,{"$f":"VLOOKUP(E2850,'[1]Combined AA and BB'!$A$1:$C$6133,3,FALSE)","v":"Y"}]
[null,null,null,null,54150,"Not covered","NA"]
[null,null,null,null,54160,"Not covered","NA"]
[null,null,null,null,54161,1414.7446410281614,{"$f":"VLOOKUP(E2853,'[1]Combined AA and BB'!$A$1:$C$6133,3,FALSE)","v":"Y"}]
[null,null,null,null,54162,"Not covered","NA"]
[null,null,null,null,54163,"Not covered","NA"]
[null,null,null,null,54164,"Not covered","NA"]
[null,null,null,null,54200,"Not covered","NA"]
[null,null,null,null,54205,"Not covered","NA"]
[null,null,null,null,54220,186.64757079156672,{"$f":"VLOOKUP(E2859,'[1]Combined AA and BB'!$A$1:$C$6133,3,FALSE)","v":"Y"}]
[null,null,null,null,54230,"Bundled","NA"]
[null,null,null,null,54231,261.38059999999996,{"$f":"VLOOKUP(E2861,'[1]Combined AA and BB'!$A$1:$C$6133,3,FALSE)","v":"Y"}]
[null,null,null,null,54235,164.3304,{"$f":"VLOOKUP(E2862,'[1]Combined AA and BB'!$A$1:$C$6133,3,FALSE)","v":"Y"}]
[null,null,null,null,54240,196.482,{"$f":"VLOOKUP(E2863,'[1]Combined AA and BB'!$A$1:$C$6133,3,FALSE)","v":"N"}]
[null,null,null,null,54250,219.70259999999999,{"$f":"VLOOKUP(E2864,'[1]Combined AA and BB'!$A$1:$C$6133,3,FALSE)","v":"Y"}]
[null,null,null,null,54300,"Not covered","NA"]
[null,null,null,null,54304,"Not covered","NA"]
[null,null,null,null,54308,"Not covered","NA"]
[null,null,null,null,54312,"Not covered","NA"]
[null,null,null,null,54316,"Not covered","NA"]
[null,null,null,null,54318,"Not covered","NA"]
[null,null,null,null,54322,"Not covered","NA"]
[null,null,null,null,54324,"Not covered","NA"]
[null,null,null,null,54326,"Not covered","NA"]
[null,null,null,null,54328,"Not covered","NA"]
[null,null,null,null,54340,"Not covered","NA"]
[null,null,null,null,54344,"Not covered","NA"]
[null,null,null,null,54348,"Not covered","NA"]
[null,null,null,null,54352,"Not covered","NA"]
[null,null,null,null,54360,"Not covered","NA"]
[null,null,null,null,54380,"Not covered","NA"]
[null,null,null,null,54385,"Not covered","NA"]
[null,null,null,null,54400,21863.582212562334,{"$f":"VLOOKUP(E2882,'[1]Combined AA and BB'!$A$1:$C$6133,3,FALSE)","v":"N"}]
[null,null,null,null,54401,36431.058960451519,{"$f":"VLOOKUP(E2883,'[1]Combined AA and BB'!$A$1:$C$6133,3,FALSE)","v":"N"}]
[null,null,null,null,54405,36221.848534689161,{"$f":"VLOOKUP(E2884,'[1]Combined AA and BB'!$A$1:$C$6133,3,FALSE)","v":"N"}]
[null,null,null,null,54406,2496.688081837452,{"$f":"VLOOKUP(E2885,'[1]Combined AA and BB'!$A$1:$C$6133,3,FALSE)","v":"N"}]
[null,null,null,null,54408,3776.4644525889162,{"$f":"VLOOKUP(E2886,'[1]Combined AA and BB'!$A$1:$C$6133,3,FALSE)","v":"Y"}]
[null,null,null,null,54410,35479.481615852324,{"$f":"VLOOKUP(E2887,'[1]Combined AA and BB'!$A$1:$C$6133,3,FALSE)","v":"N"}]
[null,null,null,null,54415,2496.688081837452,{"$f":"VLOOKUP(E2888,'[1]Combined AA and BB'!$A$1:$C$6133,3,FALSE)","v":"N"}]
[null,null,null,null,54416,35543.838294158108,{"$f":"VLOOKUP(E2889,'[1]Combined AA and BB'!$A$1:$C$6133,3,FALSE)","v":"N"}]
[null,null,null,null,54420,2496.688081837452,{"$f":"VLOOKUP(E2890,'[1]Combined AA and BB'!$A$1:$C$6133,3,FALSE)","v":"Y"}]
[null,null,null,null,54435,4256.1117937858744,{"$f":"VLOOKUP(E2891,'[1]Combined AA and BB'!$A$1:$C$6133,3,FALSE)","v":"Y"}]
[null,null,null,null,54437,2496.688081837452,{"$f":"VLOOKUP(E2892,'[1]Combined AA and BB'!$A$1:$C$6133,3,FALSE)","v":"Y"}]
[null,null,null,null,54440,2496.688081837452,{"$f":"VLOOKUP(E2893,'[1]Combined AA and BB'!$A$1:$C$6133,3,FALSE)","v":"Y"}]
[null,null,null,null,54450,"Not covered","NA"]
[null,null,null,null,54500,1789.2422303467429,{"$f":"VLOOKUP(E2895,'[1]Combined AA and BB'!$A$1:$C$6133,3,FALSE)","v":"Y"}]
[null,null,null,null,54505,2496.688081837452,{"$f":"VLOOKUP(E2896,'[1]Combined AA and BB'!$A$1:$C$6133,3,FALSE)","v":"Y"}]
[null,null,null,null,54512,2496.688081837452,{"$f":"VLOOKUP(E2897,'[1]Combined AA and BB'!$A$1:$C$6133,3,FALSE)","v":"Y"}]
[null,null,null,null,54520,2496.688081837452,{"$f":"VLOOKUP(E2898,'[1]Combined AA and BB'!$A$1:$C$6133,3,FALSE)","v":"Y"}]
[null,null,null,null,54522,2496.688081837452,{"$f":"VLOOKUP(E2899,'[1]Combined AA and BB'!$A$1:$C$6133,3,FALSE)","v":"Y"}]
[null,null,null,null,54530,2779.3325052928126,{"$f":"VLOOKUP(E2900,'[1]Combined AA and BB'!$A$1:$C$6133,3,FALSE)","v":"Y"}]
[null,null,null,null,54550,"Not covered","NA"]
[null,null,null,null,54560,"Not covered","NA"]
[null,null,null,null,54600,2496.688081837452,{"$f":"VLOOKUP(E2903,'[1]Combined AA and BB'!$A$1:$C$6133,3,FALSE)","v":"Y"}]
[null,null,null,null,54620,"Not covered","NA"]
[null,null,null,null,54640,2779.3325052928126,{"$f":"VLOOKUP(E2905,'[1]Combined AA and BB'!$A$1:$C$6133,3,FALSE)","v":"Y"}]
[null,null,null,null,54660,6623.4905310959221,{"$f":"VLOOKUP(E2906,'[1]Combined AA and BB'!$A$1:$C$6133,3,FALSE)","v":"Y"}]
[null,null,null,null,54670,2496.688081837452,{"$f":"VLOOKUP(E2907,'[1]Combined AA and BB'!$A$1:$C$6133,3,FALSE)","v":"Y"}]
[null,null,null,null,54680,2496.688081837452,{"$f":"VLOOKUP(E2908,'[1]Combined AA and BB'!$A$1:$C$6133,3,FALSE)","v":"Y"}]
[null,null,null,null,54690,4168.5316199700519,{"$f":"VLOOKUP(E2909,'[1]Combined AA and BB'!$A$1:$C$6133,3,FALSE)","v":"Y"}]
[null,null,null,null,54692,"Not covered","NA"]
[null,null,null,null,54700,1414.7446410281614,{"$f":"VLOOKUP(E2911,'[1]Combined AA and BB'!$A$1:$C$6133,3,FALSE)","v":"Y"}]
[null,null,null,null,54800,1062.8859418079082,{"$f":"VLOOKUP(E2912,'[1]Combined AA and BB'!$A$1:$C$6133,3,FALSE)","v":"Y"}]
[null,null,null,null,54830,2496.688081837452,{"$f":"VLOOKUP(E2913,'[1]Combined AA and BB'!$A$1:$C$6133,3,FALSE)","v":"Y"}]
[null,null,null,null,54840,1414.7446410281614,{"$f":"VLOOKUP(E2914,'[1]Combined AA and BB'!$A$1:$C$6133,3,FALSE)","v":"Y"}]
[null,null,null,null,54860,2496.688081837452,{"$f":"VLOOKUP(E2915,'[1]Combined AA and BB'!$A$1:$C$6133,3,FALSE)","v":"Y"}]
[null,null,null,null,54861,2496.688081837452,{"$f":"VLOOKUP(E2916,'[1]Combined AA and BB'!$A$1:$C$6133,3,FALSE)","v":"Y"}]
[null,null,null,null,54865,2496.688081837452,{"$f":"VLOOKUP(E2917,'[1]Combined AA and BB'!$A$1:$C$6133,3,FALSE)","v":"Y"}]
[null,null,null,null,54900,1414.7446410281614,{"$f":"VLOOKUP(E2918,'[1]Combined AA and BB'!$A$1:$C$6133,3,FALSE)","v":"Y"}]
[null,null,null,null,54901,2496.688081837452,{"$f":"VLOOKUP(E2919,'[1]Combined AA and BB'!$A$1:$C$6133,3,FALSE)","v":"Y"}]
[null,null,null,null,55000,221.4888,{"$f":"VLOOKUP(E2920,'[1]Combined AA and BB'!$A$1:$C$6133,3,FALSE)","v":"Y"}]
[null,null,null,null,55040,2779.3325052928126,{"$f":"VLOOKUP(E2921,'[1]Combined AA and BB'!$A$1:$C$6133,3,FALSE)","v":"Y"}]
[null,null,null,null,55041,2779.3325052928126,{"$f":"VLOOKUP(E2922,'[1]Combined AA and BB'!$A$1:$C$6133,3,FALSE)","v":"Y"}]
[null,null,null,null,55060,2496.688081837452,{"$f":"VLOOKUP(E2923,'[1]Combined AA and BB'!$A$1:$C$6133,3,FALSE)","v":"Y"}]
[null,null,null,null,55100,1062.8859418079082,{"$f":"VLOOKUP(E2924,'[1]Combined AA and BB'!$A$1:$C$6133,3,FALSE)","v":"Y"}]
[null,null,null,null,55110,2496.688081837452,{"$f":"VLOOKUP(E2925,'[1]Combined AA and BB'!$A$1:$C$6133,3,FALSE)","v":"Y"}]
[null,null,null,null,55120,1414.7446410281614,{"$f":"VLOOKUP(E2926,'[1]Combined AA and BB'!$A$1:$C$6133,3,FALSE)","v":"Y"}]
[null,null,null,null,55150,"Not covered","NA"]
[null,null,null,null,55175,2496.688081837452,{"$f":"VLOOKUP(E2928,'[1]Combined AA and BB'!$A$1:$C$6133,3,FALSE)","v":"Y"}]
[null,null,null,null,55180,3776.4644525889162,{"$f":"VLOOKUP(E2929,'[1]Combined AA and BB'!$A$1:$C$6133,3,FALSE)","v":"Y"}]
[null,null,null,null,55200,"Not covered","NA"]
[null,null,null,null,55250,"Not covered","NA"]
[null,null,null,null,55300,"Not covered","NA"]
[null,null,null,null,55400,"Not covered","NA"]
[null,null,null,null,55500,2496.688081837452,{"$f":"VLOOKUP(E2934,'[1]Combined AA and BB'!$A$1:$C$6133,3,FALSE)","v":"Y"}]
[null,null,null,null,55520,2496.688081837452,{"$f":"VLOOKUP(E2935,'[1]Combined AA and BB'!$A$1:$C$6133,3,FALSE)","v":"Y"}]
[null,null,null,null,55530,2496.688081837452,{"$f":"VLOOKUP(E2936,'[1]Combined AA and BB'!$A$1:$C$6133,3,FALSE)","v":"Y"}]
[null,null,null,null,55535,2779.3325052928126,{"$f":"VLOOKUP(E2937,'[1]Combined AA and BB'!$A$1:$C$6133,3,FALSE)","v":"Y"}]
[null,null,null,null,55540,2779.3325052928126,{"$f":"VLOOKUP(E2938,'[1]Combined AA and BB'!$A$1:$C$6133,3,FALSE)","v":"Y"}]
[null,null,null,null,55550,4168.5316199700519,{"$f":"VLOOKUP(E2939,'[1]Combined AA and BB'!$A$1:$C$6133,3,FALSE)","v":"Y"}]
[null,null,null,null,55600,1414.7446410281614,{"$f":"VLOOKUP(E2940,'[1]Combined AA and BB'!$A$1:$C$6133,3,FALSE)","v":"Y"}]
[null,null,null,null,55680,"Not covered","NA"]
[null,null,null,null,55700,1414.7446410281614,{"$f":"VLOOKUP(E2942,'[1]Combined AA and BB'!$A$1:$C$6133,3,FALSE)","v":"Y"}]
[null,null,null,null,55705,2496.688081837452,{"$f":"VLOOKUP(E2943,'[1]Combined AA and BB'!$A$1:$C$6133,3,FALSE)","v":"Y"}]
[null,null,null,null,55706,"Not covered","NA"]
[null,null,null,null,55720,2496.688081837452,{"$f":"VLOOKUP(E2945,'[1]Combined AA and BB'!$A$1:$C$6133,3,FALSE)","v":"Y"}]
[null,null,null,null,55725,2496.688081837452,{"$f":"VLOOKUP(E2946,'[1]Combined AA and BB'!$A$1:$C$6133,3,FALSE)","v":"Y"}]
[null,null,null,null,55860,"Not covered","NA"]
[null,null,null,null,55870,320.92059999999998,{"$f":"VLOOKUP(E2948,'[1]Combined AA and BB'!$A$1:$C$6133,3,FALSE)","v":"Y"}]
[null,null,null,null,55874,7822.8308429186955,{"$f":"VLOOKUP(E2949,'[1]Combined AA and BB'!$A$1:$C$6133,3,FALSE)","v":"Y"}]
[null,null,null,null,55875,"Not covered","NA"]
[null,null,null,null,55876,"Not covered","NA"]
[null,null,null,null,55880,7141.8820951235084,{"$f":"VLOOKUP(E2952,'[1]Combined AA and BB'!$A$1:$C$6133,3,FALSE)","v":"Y"}]
[null,null,null,null,55920,"Not covered","NA"]
[null,null,null,null,56405,276.26559999999995,{"$f":"VLOOKUP(E2954,'[1]Combined AA and BB'!$A$1:$C$6133,3,FALSE)","v":"Y"}]
[null,null,null,null,56420,154.73512693496264,{"$f":"VLOOKUP(E2955,'[1]Combined AA and BB'!$A$1:$C$6133,3,FALSE)","v":"Y"}]
[null,null,null,null,56440,"Not covered","NA"]
[null,null,null,null,56441,"Not covered","NA"]
[null,null,null,null,56442,"Not covered","NA"]
[null,null,null,null,56501,"Not covered","NA"]
[null,null,null,null,56515,"Not covered","NA"]
[null,null,null,null,56605,179.21539999999999,{"$f":"VLOOKUP(E2961,'[1]Combined AA and BB'!$A$1:$C$6133,3,FALSE)","v":"Y"}]
[null,null,null,null,56606,"Bundled","NA"]
[null,null,null,null,56620,"Not covered","NA"]
[null,null,null,null,56625,"Not covered","NA"]
[null,null,null,null,56700,"Not covered","NA"]
[null,null,null,null,56740,"Not covered","NA"]
[null,null,null,null,56800,2399.186006828565,{"$f":"VLOOKUP(E2967,'[1]Combined AA and BB'!$A$1:$C$6133,3,FALSE)","v":"Y"}]
[null,null,null,null,56805,"Not covered","NA"]
[null,null,null,null,56810,2399.186006828565,{"$f":"VLOOKUP(E2969,'[1]Combined AA and BB'!$A$1:$C$6133,3,FALSE)","v":"Y"}]
[null,null,null,null,56820,231.61060000000001,{"$f":"VLOOKUP(E2970,'[1]Combined AA and BB'!$A$1:$C$6133,3,FALSE)","v":"Y"}]
[null,null,null,null,56821,310.20339999999999,{"$f":"VLOOKUP(E2971,'[1]Combined AA and BB'!$A$1:$C$6133,3,FALSE)","v":"Y"}]
[null,null,null,null,57000,2399.186006828565,{"$f":"VLOOKUP(E2972,'[1]Combined AA and BB'!$A$1:$C$6133,3,FALSE)","v":"Y"}]
[null,null,null,null,57010,2399.186006828565,{"$f":"VLOOKUP(E2973,'[1]Combined AA and BB'!$A$1:$C$6133,3,FALSE)","v":"Y"}]
[null,null,null,null,57020,3349.4570952547238,{"$f":"VLOOKUP(E2974,'[1]Combined AA and BB'!$A$1:$C$6133,3,FALSE)","v":"Y"}]
[null,null,null,null,57022,1789.2422303467429,{"$f":"VLOOKUP(E2975,'[1]Combined AA and BB'!$A$1:$C$6133,3,FALSE)","v":"Y"}]
[null,null,null,null,57023,1789.2422303467429,{"$f":"VLOOKUP(E2976,'[1]Combined AA and BB'!$A$1:$C$6133,3,FALSE)","v":"Y"}]
[null,null,null,null,57061,"Not covered","NA"]
[null,null,null,null,57065,"Not covered","NA"]
[null,null,null,null,57100,191.71880000000002,{"$f":"VLOOKUP(E2979,'[1]Combined AA and BB'!$A$1:$C$6133,3,FALSE)","v":"Y"}]
[null,null,null,null,57105,2399.186006828565,{"$f":"VLOOKUP(E2980,'[1]Combined AA and BB'!$A$1:$C$6133,3,FALSE)","v":"Y"}]
[null,null,null,null,57130,"Not covered","NA"]
[null,null,null,null,57135,"Not covered","NA"]
[null,null,null,null,57150,"Bundled","NA"]
[null,null,null,null,57155,"Not covered","NA"]
[null,null,null,null,57156,"Not covered","NA"]
[null,null,null,null,57160,138.13279999999997,{"$f":"VLOOKUP(E2986,'[1]Combined AA and BB'!$A$1:$C$6133,3,FALSE)","v":"Y"}]
[null,null,null,null,57170,"Not covered","NA"]
[null,null,null,null,57180,154.73512693496264,{"$f":"VLOOKUP(E2988,'[1]Combined AA and BB'!$A$1:$C$6133,3,FALSE)","v":"Y"}]
[null,null,null,null,57200,2399.186006828565,{"$f":"VLOOKUP(E2989,'[1]Combined AA and BB'!$A$1:$C$6133,3,FALSE)","v":"Y"}]
[null,null,null,null,57210,2399.186006828565,{"$f":"VLOOKUP(E2990,'[1]Combined AA and BB'!$A$1:$C$6133,3,FALSE)","v":"Y"}]
[null,null,null,null,57220,3349.4570952547238,{"$f":"VLOOKUP(E2991,'[1]Combined AA and BB'!$A$1:$C$6133,3,FALSE)","v":"Y"}]
[null,null,null,null,57230,2399.186006828565,{"$f":"VLOOKUP(E2992,'[1]Combined AA and BB'!$A$1:$C$6133,3,FALSE)","v":"Y"}]
[null,null,null,null,57240,3349.4570952547238,{"$f":"VLOOKUP(E2993,'[1]Combined AA and BB'!$A$1:$C$6133,3,FALSE)","v":"Y"}]
[null,null,null,null,57250,3349.4570952547238,{"$f":"VLOOKUP(E2994,'[1]Combined AA and BB'!$A$1:$C$6133,3,FALSE)","v":"Y"}]
[null,null,null,null,57260,3349.4570952547238,{"$f":"VLOOKUP(E2995,'[1]Combined AA and BB'!$A$1:$C$6133,3,FALSE)","v":"Y"}]
[null,null,null,null,57265,3349.4570952547238,{"$f":"VLOOKUP(E2996,'[1]Combined AA and BB'!$A$1:$C$6133,3,FALSE)","v":"Y"}]
[null,null,null,null,57267,"Bundled","NA"]
[null,null,null,null,57268,3349.4570952547238,{"$f":"VLOOKUP(E2998,'[1]Combined AA and BB'!$A$1:$C$6133,3,FALSE)","v":"Y"}]
[null,null,null,null,57287,2399.186006828565,{"$f":"VLOOKUP(E2999,'[1]Combined AA and BB'!$A$1:$C$6133,3,FALSE)","v":"N"}]
[null,null,null,null,57288,5839.67991475088,{"$f":"VLOOKUP(E3000,'[1]Combined AA and BB'!$A$1:$C$6133,3,FALSE)","v":"Y"}]
[null,null,null,null,57289,4680.203408864174,{"$f":"VLOOKUP(E3001,'[1]Combined AA and BB'!$A$1:$C$6133,3,FALSE)","v":"Y"}]
[null,null,null,null,57291,"Not covered","NA"]
[null,null,null,null,57300,2399.186006828565,{"$f":"VLOOKUP(E3003,'[1]Combined AA and BB'!$A$1:$C$6133,3,FALSE)","v":"Y"}]
[null,null,null,null,57320,3349.4570952547238,{"$f":"VLOOKUP(E3004,'[1]Combined AA and BB'!$A$1:$C$6133,3,FALSE)","v":"Y"}]
[null,null,null,null,57400,"Not covered","NA"]
[null,null,null,null,57410,2399.186006828565,{"$f":"VLOOKUP(E3006,'[1]Combined AA and BB'!$A$1:$C$6133,3,FALSE)","v":"Y"}]
[null,null,null,null,57415,2399.186006828565,{"$f":"VLOOKUP(E3007,'[1]Combined AA and BB'!$A$1:$C$6133,3,FALSE)","v":"Y"}]
[null,null,null,null,57420,244.70940000000002,{"$f":"VLOOKUP(E3008,'[1]Combined AA and BB'!$A$1:$C$6133,3,FALSE)","v":"Y"}]
[null,null,null,null,57421,328.06540000000001,{"$f":"VLOOKUP(E3009,'[1]Combined AA and BB'!$A$1:$C$6133,3,FALSE)","v":"Y"}]
[null,null,null,null,57426,4680.203408864174,{"$f":"VLOOKUP(E3010,'[1]Combined AA and BB'!$A$1:$C$6133,3,FALSE)","v":"Y"}]
[null,null,null,null,57452,235.18300000000002,{"$f":"VLOOKUP(E3011,'[1]Combined AA and BB'!$A$1:$C$6133,3,FALSE)","v":"Y"}]
[null,null,null,null,57454,310.79879999999997,{"$f":"VLOOKUP(E3012,'[1]Combined AA and BB'!$A$1:$C$6133,3,FALSE)","v":"Y"}]
[null,null,null,null,57455,298.29539999999997,{"$f":"VLOOKUP(E3013,'[1]Combined AA and BB'!$A$1:$C$6133,3,FALSE)","v":"Y"}]
[null,null,null,null,57456,281.62420000000003,{"$f":"VLOOKUP(E3014,'[1]Combined AA and BB'!$A$1:$C$6133,3,FALSE)","v":"Y"}]
[null,null,null,null,57460,591.82759999999996,{"$f":"VLOOKUP(E3015,'[1]Combined AA and BB'!$A$1:$C$6133,3,FALSE)","v":"Y"}]
[null,null,null,null,57461,657.91700000000003,{"$f":"VLOOKUP(E3016,'[1]Combined AA and BB'!$A$1:$C$6133,3,FALSE)","v":"Y"}]
[null,null,null,null,57500,290.55520000000001,{"$f":"VLOOKUP(E3017,'[1]Combined AA and BB'!$A$1:$C$6133,3,FALSE)","v":"Y"}]
[null,null,null,null,57505,292.93680000000001,{"$f":"VLOOKUP(E3018,'[1]Combined AA and BB'!$A$1:$C$6133,3,FALSE)","v":"Y"}]
[null,null,null,null,57510,"Not covered","NA"]
[null,null,null,null,57511,"Not covered","NA"]
[null,null,null,null,57513,"Not covered","NA"]
[null,null,null,null,57520,"Not covered","NA"]
[null,null,null,null,57522,"Not covered","NA"]
[null,null,null,null,57530,"Not covered","NA"]
[null,null,null,null,57550,3349.4570952547238,{"$f":"VLOOKUP(E3025,'[1]Combined AA and BB'!$A$1:$C$6133,3,FALSE)","v":"Y"}]
[null,null,null,null,57556,3349.4570952547238,{"$f":"VLOOKUP(E3026,'[1]Combined AA and BB'!$A$1:$C$6133,3,FALSE)","v":"Y"}]
[null,null,null,null,57558,2399.186006828565,{"$f":"VLOOKUP(E3027,'[1]Combined AA and BB'!$A$1:$C$6133,3,FALSE)","v":"Y"}]
[null,null,null,null,57700,"Not covered","NA"]
[null,null,null,null,57720,2399.186006828565,{"$f":"VLOOKUP(E3029,'[1]Combined AA and BB'!$A$1:$C$6133,3,FALSE)","v":"Y"}]
[null,null,null,null,57800,145.27760000000001,{"$f":"VLOOKUP(E3030,'[1]Combined AA and BB'!$A$1:$C$6133,3,FALSE)","v":"Y"}]
[null,null,null,null,58100,188.1464,{"$f":"VLOOKUP(E3031,'[1]Combined AA and BB'!$A$1:$C$6133,3,FALSE)","v":"Y"}]
[null,null,null,null,58110,"Not covered","NA"]
[null,null,null,null,58120,2399.186006828565,{"$f":"VLOOKUP(E3033,'[1]Combined AA and BB'!$A$1:$C$6133,3,FALSE)","v":"Y"}]
[null,null,null,null,58145,"Not covered","NA"]
[null,null,null,null,58301,"Not covered","NA"]
[null,null,null,null,58321,"Not covered","NA"]
[null,null,null,null,58322,"Not covered","NA"]
[null,null,null,null,58323,"Not covered","NA"]
[null,null,null,null,58340,"Not covered","NA"]
[null,null,null,null,58345,"Not covered","NA"]
[null,null,null,null,58346,"Not covered","NA"]
[null,null,null,null,58350,"Not covered","NA"]
[null,null,null,null,58353,"Not covered","NA"]
[null,null,null,null,58356,"Not covered","NA"]
[null,null,null,null,58545,"Not covered","NA"]
[null,null,null,null,58546,"Not covered","NA"]
[null,null,null,null,58550,4168.5316199700519,{"$f":"VLOOKUP(E3047,'[1]Combined AA and BB'!$A$1:$C$6133,3,FALSE)","v":"Y"}]
[null,null,null,null,58552,7140.4028248878139,{"$f":"VLOOKUP(E3048,'[1]Combined AA and BB'!$A$1:$C$6133,3,FALSE)","v":"Y"}]
[null,null,null,null,58555,2399.186006828565,{"$f":"VLOOKUP(E3049,'[1]Combined AA and BB'!$A$1:$C$6133,3,FALSE)","v":"Y"}]
[null,null,null,null,58558,2399.186006828565,{"$f":"VLOOKUP(E3050,'[1]Combined AA and BB'!$A$1:$C$6133,3,FALSE)","v":"Y"}]
[null,null,null,null,58559,3349.4570952547238,{"$f":"VLOOKUP(E3051,'[1]Combined AA and BB'!$A$1:$C$6133,3,FALSE)","v":"Y"}]
[null,null,null,null,58560,"Not covered","NA"]
[null,null,null,null,58561,"Not covered","NA"]
[null,null,null,null,58562,2399.186006828565,{"$f":"VLOOKUP(E3054,'[1]Combined AA and BB'!$A$1:$C$6133,3,FALSE)","v":"Y"}]
[null,null,null,null,58563,"Not covered","NA"]
[null,null,null,null,58565,"Not covered","NA"]
[null,null,null,null,58600,"Not covered","NA"]
[null,null,null,null,58615,"Not covered","NA"]
[null,null,null,null,58660,4168.5316199700519,{"$f":"VLOOKUP(E3059,'[1]Combined AA and BB'!$A$1:$C$6133,3,FALSE)","v":"Y"}]
[null,null,null,null,58661,"Not covered","NA"]
[null,null,null,null,58662,"Not covered","NA"]
[null,null,null,null,58670,"Not covered","NA"]
[null,null,null,null,58671,"Not covered","NA"]
[null,null,null,null,58672,"Not covered","NA"]
[null,null,null,null,58673,"Not covered","NA"]
[null,null,null,null,58674,"Not covered","NA"]
[null,null,null,null,58800,"Not covered","NA"]
[null,null,null,null,58805,"Not covered","NA"]
[null,null,null,null,58820,"Not covered","NA"]
[null,null,null,null,58900,2399.186006828565,{"$f":"VLOOKUP(E3070,'[1]Combined AA and BB'!$A$1:$C$6133,3,FALSE)","v":"Y"}]
[null,null,null,null,58970,"Not covered","NA"]
[null,null,null,null,58974,"Not covered","NA"]
[null,null,null,null,58976,"Not covered","NA"]
[null,null,null,null,59000,214.34399999999999,{"$f":"VLOOKUP(E3074,'[1]Combined AA and BB'!$A$1:$C$6133,3,FALSE)","v":"Y"}]
[null,null,null,null,59001,253.61266374195225,{"$f":"VLOOKUP(E3075,'[1]Combined AA and BB'!$A$1:$C$6133,3,FALSE)","v":"Y"}]
[null,null,null,null,59012,253.61266374195225,{"$f":"VLOOKUP(E3076,'[1]Combined AA and BB'!$A$1:$C$6133,3,FALSE)","v":"Y"}]
[null,null,null,null,59015,283.41039999999998,{"$f":"VLOOKUP(E3077,'[1]Combined AA and BB'!$A$1:$C$6133,3,FALSE)","v":"Y"}]
[null,null,null,null,59020,129.7972,{"$f":"VLOOKUP(E3078,'[1]Combined AA and BB'!$A$1:$C$6133,3,FALSE)","v":"Y"}]
[null,null,null,null,59025,89.31,{"$f":"VLOOKUP(E3079,'[1]Combined AA and BB'!$A$1:$C$6133,3,FALSE)","v":"Y"}]
[null,null,null,null,59070,253.61266374195225,{"$f":"VLOOKUP(E3080,'[1]Combined AA and BB'!$A$1:$C$6133,3,FALSE)","v":"Y"}]
[null,null,null,null,59072,458.53279605064807,{"$f":"VLOOKUP(E3081,'[1]Combined AA and BB'!$A$1:$C$6133,3,FALSE)","v":"Y"}]
[null,null,null,null,59076,253.61266374195225,{"$f":"VLOOKUP(E3082,'[1]Combined AA and BB'!$A$1:$C$6133,3,FALSE)","v":"Y"}]
[null,null,null,null,59100,"Not covered","NA"]
[null,null,null,null,59150,4168.5316199700519,{"$f":"VLOOKUP(E3084,'[1]Combined AA and BB'!$A$1:$C$6133,3,FALSE)","v":"Y"}]
[null,null,null,null,59151,4168.5316199700519,{"$f":"VLOOKUP(E3085,'[1]Combined AA and BB'!$A$1:$C$6133,3,FALSE)","v":"Y"}]
[null,null,null,null,59160,2399.186006828565,{"$f":"VLOOKUP(E3086,'[1]Combined AA and BB'!$A$1:$C$6133,3,FALSE)","v":"Y"}]
[null,null,null,null,59200,197.6728,{"$f":"VLOOKUP(E3087,'[1]Combined AA and BB'!$A$1:$C$6133,3,FALSE)","v":"Y"}]
[null,null,null,null,59300,425.71100000000001,{"$f":"VLOOKUP(E3088,'[1]Combined AA and BB'!$A$1:$C$6133,3,FALSE)","v":"Y"}]
[null,null,null,null,59320,2399.186006828565,{"$f":"VLOOKUP(E3089,'[1]Combined AA and BB'!$A$1:$C$6133,3,FALSE)","v":"Y"}]
[null,null,null,null,59412,2399.186006828565,{"$f":"VLOOKUP(E3090,'[1]Combined AA and BB'!$A$1:$C$6133,3,FALSE)","v":"Y"}]
[null,null,null,null,59414,2399.186006828565,{"$f":"VLOOKUP(E3091,'[1]Combined AA and BB'!$A$1:$C$6133,3,FALSE)","v":"Y"}]
[null,null,null,null,59812,2399.186006828565,{"$f":"VLOOKUP(E3092,'[1]Combined AA and BB'!$A$1:$C$6133,3,FALSE)","v":"Y"}]
[null,null,null,null,59820,2399.186006828565,{"$f":"VLOOKUP(E3093,'[1]Combined AA and BB'!$A$1:$C$6133,3,FALSE)","v":"Y"}]
[null,null,null,null,59821,2399.186006828565,{"$f":"VLOOKUP(E3094,'[1]Combined AA and BB'!$A$1:$C$6133,3,FALSE)","v":"Y"}]
[null,null,null,null,59840,2399.186006828565,{"$f":"VLOOKUP(E3095,'[1]Combined AA and BB'!$A$1:$C$6133,3,FALSE)","v":"Y"}]
[null,null,null,null,59841,2399.186006828565,{"$f":"VLOOKUP(E3096,'[1]Combined AA and BB'!$A$1:$C$6133,3,FALSE)","v":"Y"}]
[null,null,null,null,59866,"Not covered","NA"]
[null,null,null,null,59870,"Not covered","NA"]
[null,null,null,null,59871,2399.186006828565,{"$f":"VLOOKUP(E3099,'[1]Combined AA and BB'!$A$1:$C$6133,3,FALSE)","v":"N"}]
[null,null,null,null,60000,"Not covered","NA"]
[null,null,null,null,60100,202.43599999999998,{"$f":"VLOOKUP(E3101,'[1]Combined AA and BB'!$A$1:$C$6133,3,FALSE)","v":"Y"}]
[null,null,null,null,60200,4168.5316199700519,{"$f":"VLOOKUP(E3102,'[1]Combined AA and BB'!$A$1:$C$6133,3,FALSE)","v":"Y"}]
[null,null,null,null,60280,"Not covered","NA"]
[null,null,null,null,60281,"Not covered","NA"]
[null,null,null,null,60300,201.24519999999998,{"$f":"VLOOKUP(E3105,'[1]Combined AA and BB'!$A$1:$C$6133,3,FALSE)","v":"Y"}]
[null,null,null,null,61000,"Not covered","NA"]
[null,null,null,null,61001,"Not covered","NA"]
[null,null,null,null,61020,740.24931776998312,{"$f":"VLOOKUP(E3108,'[1]Combined AA and BB'!$A$1:$C$6133,3,FALSE)","v":"Y"}]
[null,null,null,null,61026,559.70914339011665,{"$f":"VLOOKUP(E3109,'[1]Combined AA and BB'!$A$1:$C$6133,3,FALSE)","v":"Y"}]
[null,null,null,null,61050,236.18149692952142,{"$f":"VLOOKUP(E3110,'[1]Combined AA and BB'!$A$1:$C$6133,3,FALSE)","v":"Y"}]
[null,null,null,null,61055,236.18149692952142,{"$f":"VLOOKUP(E3111,'[1]Combined AA and BB'!$A$1:$C$6133,3,FALSE)","v":"Y"}]
[null,null,null,null,61070,559.70914339011665,{"$f":"VLOOKUP(E3112,'[1]Combined AA and BB'!$A$1:$C$6133,3,FALSE)","v":"Y"}]
[null,null,null,null,61215,4390.2750933710631,{"$f":"VLOOKUP(E3113,'[1]Combined AA and BB'!$A$1:$C$6133,3,FALSE)","v":"Y"}]
[null,null,null,null,61330,1916.5286762415849,{"$f":"VLOOKUP(E3114,'[1]Combined AA and BB'!$A$1:$C$6133,3,FALSE)","v":"Y"}]
[null,null,null,null,61781,"Bundled","NA"]
[null,null,null,null,61782,"Bundled","NA"]
[null,null,null,null,61783,"Bundled","NA"]
[null,null,null,null,61790,"Not covered","NA"]
[null,null,null,null,61791,"Not covered","NA"]
[null,null,null,null,61880,"Not covered","NA"]
[null,null,null,null,61885,43213.130538975136,{"$f":"VLOOKUP(E3121,'[1]Combined AA and BB'!$A$1:$C$6133,3,FALSE)","v":"N"}]
[null,null,null,null,61886,54491.359540713514,{"$f":"VLOOKUP(E3122,'[1]Combined AA and BB'!$A$1:$C$6133,3,FALSE)","v":"N"}]
[null,null,null,null,61888,23025.087080683581,{"$f":"VLOOKUP(E3123,'[1]Combined AA and BB'!$A$1:$C$6133,3,FALSE)","v":"Y"}]
[null,null,null,null,62194,1424.7621552558512,{"$f":"VLOOKUP(E3124,'[1]Combined AA and BB'!$A$1:$C$6133,3,FALSE)","v":"Y"}]
[null,null,null,null,62225,4390.2750933710631,{"$f":"VLOOKUP(E3125,'[1]Combined AA and BB'!$A$1:$C$6133,3,FALSE)","v":"Y"}]
[null,null,null,null,62230,7438.9786564124906,{"$f":"VLOOKUP(E3126,'[1]Combined AA and BB'!$A$1:$C$6133,3,FALSE)","v":"Y"}]
[null,null,null,null,62252,154.20859999999999,{"$f":"VLOOKUP(E3127,'[1]Combined AA and BB'!$A$1:$C$6133,3,FALSE)","v":"N"}]
[null,null,null,null,62263,"Not covered","NA"]
[null,null,null,null,62264,740.24931776998312,{"$f":"VLOOKUP(E3129,'[1]Combined AA and BB'!$A$1:$C$6133,3,FALSE)","v":"Y"}]
[null,null,null,null,62267,563.74037104996432,{"$f":"VLOOKUP(E3130,'[1]Combined AA and BB'!$A$1:$C$6133,3,FALSE)","v":"Y"}]
[null,null,null,null,62268,740.24931776998312,{"$f":"VLOOKUP(E3131,'[1]Combined AA and BB'!$A$1:$C$6133,3,FALSE)","v":"Y"}]
[null,null,null,null,62269,1062.8859418079082,{"$f":"VLOOKUP(E3132,'[1]Combined AA and BB'!$A$1:$C$6133,3,FALSE)","v":"Y"}]
[null,null,null,null,62270,559.70914339011665,{"$f":"VLOOKUP(E3133,'[1]Combined AA and BB'!$A$1:$C$6133,3,FALSE)","v":"Y"}]
[null,null,null,null,62272,559.70914339011665,{"$f":"VLOOKUP(E3134,'[1]Combined AA and BB'!$A$1:$C$6133,3,FALSE)","v":"Y"}]
[null,null,null,null,62273,559.70914339011665,{"$f":"VLOOKUP(E3135,'[1]Combined AA and BB'!$A$1:$C$6133,3,FALSE)","v":"Y"}]
[null,null,null,null,62280,"Not covered","NA"]
[null,null,null,null,62281,740.24931776998312,{"$f":"VLOOKUP(E3137,'[1]Combined AA and BB'!$A$1:$C$6133,3,FALSE)","v":"Y"}]
[null,null,null,null,62282,740.24931776998312,{"$f":"VLOOKUP(E3138,'[1]Combined AA and BB'!$A$1:$C$6133,3,FALSE)","v":"Y"}]
[null,null,null,null,62284,"Bundled","NA"]
[null,null,null,null,62287,1424.7621552558512,{"$f":"VLOOKUP(E3140,'[1]Combined AA and BB'!$A$1:$C$6133,3,FALSE)","v":"Y"}]
[null,null,null,null,62290,"Bundled","NA"]
[null,null,null,null,62291,"Bundled","NA"]
[null,null,null,null,62292,1424.7621552558512,{"$f":"VLOOKUP(E3143,'[1]Combined AA and BB'!$A$1:$C$6133,3,FALSE)","v":"Y"}]
[null,null,null,null,62294,740.24931776998312,{"$f":"VLOOKUP(E3144,'[1]Combined AA and BB'!$A$1:$C$6133,3,FALSE)","v":"Y"}]
[null,null,null,null,62302,"Bundled","NA"]
[null,null,null,null,62303,"Bundled","NA"]
[null,null,null,null,62304,"Bundled","NA"]
[null,null,null,null,62305,"Bundled","NA"]
[null,null,null,null,62320,559.70914339011665,{"$f":"VLOOKUP(E3149,'[1]Combined AA and BB'!$A$1:$C$6133,3,FALSE)","v":"Y"}]
[null,null,null,null,62321,559.70914339011665,{"$f":"VLOOKUP(E3150,'[1]Combined AA and BB'!$A$1:$C$6133,3,FALSE)","v":"Y"}]
[null,null,null,null,62322,740.24931776998312,{"$f":"VLOOKUP(E3151,'[1]Combined AA and BB'!$A$1:$C$6133,3,FALSE)","v":"Y"}]
[null,null,null,null,62323,559.70914339011665,{"$f":"VLOOKUP(E3152,'[1]Combined AA and BB'!$A$1:$C$6133,3,FALSE)","v":"Y"}]
[null,null,null,null,62324,740.24931776998312,{"$f":"VLOOKUP(E3153,'[1]Combined AA and BB'!$A$1:$C$6133,3,FALSE)","v":"Y"}]
[null,null,null,null,62325,740.24931776998312,{"$f":"VLOOKUP(E3154,'[1]Combined AA and BB'!$A$1:$C$6133,3,FALSE)","v":"Y"}]
[null,null,null,null,62326,740.24931776998312,{"$f":"VLOOKUP(E3155,'[1]Combined AA and BB'!$A$1:$C$6133,3,FALSE)","v":"Y"}]
[null,null,null,null,62327,740.24931776998312,{"$f":"VLOOKUP(E3156,'[1]Combined AA and BB'!$A$1:$C$6133,3,FALSE)","v":"Y"}]
[null,null,null,null,62328,559.70914339011665,{"$f":"VLOOKUP(E3157,'[1]Combined AA and BB'!$A$1:$C$6133,3,FALSE)","v":"Y"}]
[null,null,null,null,62329,559.70914339011665,{"$f":"VLOOKUP(E3158,'[1]Combined AA and BB'!$A$1:$C$6133,3,FALSE)","v":"Y"}]
[null,null,null,null,62350,7816.5135531309861,{"$f":"VLOOKUP(E3159,'[1]Combined AA and BB'!$A$1:$C$6133,3,FALSE)","v":"Y"}]
[null,null,null,null,62355,1424.7621552558512,{"$f":"VLOOKUP(E3160,'[1]Combined AA and BB'!$A$1:$C$6133,3,FALSE)","v":"N"}]
[null,null,null,null,62360,30991.565125621913,{"$f":"VLOOKUP(E3161,'[1]Combined AA and BB'!$A$1:$C$6133,3,FALSE)","v":"Y"}]
[null,null,null,null,62361,29695.2458786797,{"$f":"VLOOKUP(E3162,'[1]Combined AA and BB'!$A$1:$C$6133,3,FALSE)","v":"Y"}]
[null,null,null,null,62362,31053.531478062083,{"$f":"VLOOKUP(E3163,'[1]Combined AA and BB'!$A$1:$C$6133,3,FALSE)","v":"Y"}]
[null,null,null,null,62365,4390.2750933710631,{"$f":"VLOOKUP(E3164,'[1]Combined AA and BB'!$A$1:$C$6133,3,FALSE)","v":"N"}]
[null,null,null,null,62367,58.349199999999996,{"$f":"VLOOKUP(E3165,'[1]Combined AA and BB'!$A$1:$C$6133,3,FALSE)","v":"N"}]
[null,null,null,null,62368,80.379000000000005,{"$f":"VLOOKUP(E3166,'[1]Combined AA and BB'!$A$1:$C$6133,3,FALSE)","v":"N"}]
[null,null,null,null,62369,172.666,{"$f":"VLOOKUP(E3167,'[1]Combined AA and BB'!$A$1:$C$6133,3,FALSE)","v":"N"}]
[null,null,null,null,62370,172.666,{"$f":"VLOOKUP(E3168,'[1]Combined AA and BB'!$A$1:$C$6133,3,FALSE)","v":"N"}]
[null,null,null,null,62380,5235.154665531295,{"$f":"VLOOKUP(E3169,'[1]Combined AA and BB'!$A$1:$C$6133,3,FALSE)","v":"Y"}]
[null,null,null,null,63020,5235.154665531295,{"$f":"VLOOKUP(E3170,'[1]Combined AA and BB'!$A$1:$C$6133,3,FALSE)","v":"Y"}]
[null,null,null,null,63030,5235.154665531295,{"$f":"VLOOKUP(E3171,'[1]Combined AA and BB'!$A$1:$C$6133,3,FALSE)","v":"Y"}]
[null,null,null,null,63035,"Not covered","NA"]
[null,null,null,null,63042,5235.154665531295,{"$f":"VLOOKUP(E3173,'[1]Combined AA and BB'!$A$1:$C$6133,3,FALSE)","v":"Y"}]
[null,null,null,null,63044,"Bundled","NA"]
[null,null,null,null,63045,5235.154665531295,{"$f":"VLOOKUP(E3175,'[1]Combined AA and BB'!$A$1:$C$6133,3,FALSE)","v":"Y"}]
[null,null,null,null,63047,5235.154665531295,{"$f":"VLOOKUP(E3176,'[1]Combined AA and BB'!$A$1:$C$6133,3,FALSE)","v":"Y"}]
[null,null,null,null,63048,"Not covered","NA"]
[null,null,null,null,63056,5235.154665531295,{"$f":"VLOOKUP(E3178,'[1]Combined AA and BB'!$A$1:$C$6133,3,FALSE)","v":"Y"}]
[null,null,null,null,63057,"Not covered","NA"]
[null,null,null,null,63075,"Not covered","NA"]
[null,null,null,null,63076,"Not covered","NA"]
[null,null,null,null,63600,1424.7621552558512,{"$f":"VLOOKUP(E3182,'[1]Combined AA and BB'!$A$1:$C$6133,3,FALSE)","v":"Y"}]
[null,null,null,null,63610,2717.0151164255226,{"$f":"VLOOKUP(E3183,'[1]Combined AA and BB'!$A$1:$C$6133,3,FALSE)","v":"Y"}]
[null,null,null,null,63650,"Not covered","NA"]
[null,null,null,null,63655,"Not covered","NA"]
[null,null,null,null,63661,"Not covered","NA"]
[null,null,null,null,63662,"Not covered","NA"]
[null,null,null,null,63663,"Not covered","NA"]
[null,null,null,null,63664,"Not covered","NA"]
[null,null,null,null,63685,"Not covered","NA"]
[null,null,null,null,63688,"Not covered","NA"]
[null,null,null,null,63709,"UR/BR","N"]
[null,null,null,null,63744,7853.1879814120693,{"$f":"VLOOKUP(E3193,'[1]Combined AA and BB'!$A$1:$C$6133,3,FALSE)","v":"Y"}]
[null,null,null,null,63746,1424.7621552558512,{"$f":"VLOOKUP(E3194,'[1]Combined AA and BB'!$A$1:$C$6133,3,FALSE)","v":"N"}]
[null,null,null,null,64400,209.58080000000001,{"$f":"VLOOKUP(E3195,'[1]Combined AA and BB'!$A$1:$C$6133,3,FALSE)","v":"Y"}]
[null,null,null,null,64405,136.3466,{"$f":"VLOOKUP(E3196,'[1]Combined AA and BB'!$A$1:$C$6133,3,FALSE)","v":"Y"}]
[null,null,null,null,64408,153.01779999999999,{"$f":"VLOOKUP(E3197,'[1]Combined AA and BB'!$A$1:$C$6133,3,FALSE)","v":"Y"}]
[null,null,null,null,64415,740.24931776998312,{"$f":"VLOOKUP(E3198,'[1]Combined AA and BB'!$A$1:$C$6133,3,FALSE)","v":"Y"}]
[null,null,null,null,64416,740.24931776998312,{"$f":"VLOOKUP(E3199,'[1]Combined AA and BB'!$A$1:$C$6133,3,FALSE)","v":"Y"}]
[null,null,null,null,64417,740.24931776998312,{"$f":"VLOOKUP(E3200,'[1]Combined AA and BB'!$A$1:$C$6133,3,FALSE)","v":"Y"}]
[null,null,null,null,64418,160.75800000000001,{"$f":"VLOOKUP(E3201,'[1]Combined AA and BB'!$A$1:$C$6133,3,FALSE)","v":"Y"}]
[null,null,null,null,64420,559.70914339011665,{"$f":"VLOOKUP(E3202,'[1]Combined AA and BB'!$A$1:$C$6133,3,FALSE)","v":"Y"}]
[null,null,null,null,64421,740.24931776998312,{"$f":"VLOOKUP(E3203,'[1]Combined AA and BB'!$A$1:$C$6133,3,FALSE)","v":"Y"}]
[null,null,null,null,64425,206.60380000000001,{"$f":"VLOOKUP(E3204,'[1]Combined AA and BB'!$A$1:$C$6133,3,FALSE)","v":"Y"}]
[null,null,null,null,64430,740.24931776998312,{"$f":"VLOOKUP(E3205,'[1]Combined AA and BB'!$A$1:$C$6133,3,FALSE)","v":"Y"}]
[null,null,null,null,64435,151.23159999999999,{"$f":"VLOOKUP(E3206,'[1]Combined AA and BB'!$A$1:$C$6133,3,FALSE)","v":"Y"}]
[null,null,null,null,64445,301.27239999999995,{"$f":"VLOOKUP(E3207,'[1]Combined AA and BB'!$A$1:$C$6133,3,FALSE)","v":"Y"}]
[null,null,null,null,64446,740.24931776998312,{"$f":"VLOOKUP(E3208,'[1]Combined AA and BB'!$A$1:$C$6133,3,FALSE)","v":"Y"}]
[null,null,null,null,64447,216.1302,{"$f":"VLOOKUP(E3209,'[1]Combined AA and BB'!$A$1:$C$6133,3,FALSE)","v":"Y"}]
[null,null,null,null,64448,1281.749641666054,{"$f":"VLOOKUP(E3210,'[1]Combined AA and BB'!$A$1:$C$6133,3,FALSE)","v":"Y"}]
[null,null,null,null,64450,139.3236,{"$f":"VLOOKUP(E3211,'[1]Combined AA and BB'!$A$1:$C$6133,3,FALSE)","v":"Y"}]
[null,null,null,null,64451,559.70914339011665,{"$f":"VLOOKUP(E3212,'[1]Combined AA and BB'!$A$1:$C$6133,3,FALSE)","v":"Y"}]
[null,null,null,null,64454,"Not covered","NA"]
[null,null,null,null,64455,91.096199999999996,{"$f":"VLOOKUP(E3214,'[1]Combined AA and BB'!$A$1:$C$6133,3,FALSE)","v":"Y"}]
[null,null,null,null,64461,559.70914339011665,{"$f":"VLOOKUP(E3215,'[1]Combined AA and BB'!$A$1:$C$6133,3,FALSE)","v":"Y"}]
[null,null,null,null,64462,"Bundled","NA"]
[null,null,null,null,64463,559.70914339011665,{"$f":"VLOOKUP(E3217,'[1]Combined AA and BB'!$A$1:$C$6133,3,FALSE)","v":"Y"}]
[null,null,null,null,64479,740.24931776998312,{"$f":"VLOOKUP(E3218,'[1]Combined AA and BB'!$A$1:$C$6133,3,FALSE)","v":"Y"}]
[null,null,null,null,64480,"Bundled","NA"]
[null,null,null,null,64483,740.24931776998312,{"$f":"VLOOKUP(E3220,'[1]Combined AA and BB'!$A$1:$C$6133,3,FALSE)","v":"Y"}]
[null,null,null,null,64484,"Bundled","NA"]
[null,null,null,null,64486,"Bundled","NA"]
[null,null,null,null,64487,"Bundled","NA"]
[null,null,null,null,64488,"Bundled","NA"]
[null,null,null,null,64489,"Bundled","NA"]
[null,null,null,null,64490,740.24931776998312,{"$f":"VLOOKUP(E3226,'[1]Combined AA and BB'!$A$1:$C$6133,3,FALSE)","v":"Y"}]
[null,null,null,null,64491,"Bundled","NA"]
[null,null,null,null,64492,"Bundled","NA"]
[null,null,null,null,64493,740.24931776998312,{"$f":"VLOOKUP(E3229,'[1]Combined AA and BB'!$A$1:$C$6133,3,FALSE)","v":"Y"}]
[null,null,null,null,64494,"Bundled","NA"]
[null,null,null,null,64495,"Bundled","NA"]
[null,null,null,null,64505,264.35760000000005,{"$f":"VLOOKUP(E3232,'[1]Combined AA and BB'!$A$1:$C$6133,3,FALSE)","v":"Y"}]
[null,null,null,null,64510,740.24931776998312,{"$f":"VLOOKUP(E3233,'[1]Combined AA and BB'!$A$1:$C$6133,3,FALSE)","v":"Y"}]
[null,null,null,null,64517,"Not covered","NA"]
[null,null,null,null,64520,740.24931776998312,{"$f":"VLOOKUP(E3235,'[1]Combined AA and BB'!$A$1:$C$6133,3,FALSE)","v":"Y"}]
[null,null,null,null,64530,740.24931776998312,{"$f":"VLOOKUP(E3236,'[1]Combined AA and BB'!$A$1:$C$6133,3,FALSE)","v":"Y"}]
[null,null,null,null,64553,21951.660029458366,{"$f":"VLOOKUP(E3237,'[1]Combined AA and BB'!$A$1:$C$6133,3,FALSE)","v":"N"}]
[null,null,null,null,64555,"Not covered","NA"]
[null,null,null,null,64561,10951.357630866883,{"$f":"VLOOKUP(E3239,'[1]Combined AA and BB'!$A$1:$C$6133,3,FALSE)","v":"N"}]
[null,null,null,null,64566,"Not covered","NA"]
[null,null,null,null,64568,54370.522876954354,{"$f":"VLOOKUP(E3241,'[1]Combined AA and BB'!$A$1:$C$6133,3,FALSE)","v":"N"}]
[null,null,null,null,64569,25253.50820767225,{"$f":"VLOOKUP(E3242,'[1]Combined AA and BB'!$A$1:$C$6133,3,FALSE)","v":"N"}]
[null,null,null,null,64570,4390.2750933710631,{"$f":"VLOOKUP(E3243,'[1]Combined AA and BB'!$A$1:$C$6133,3,FALSE)","v":"N"}]
[null,null,null,null,64575,"Not covered","NA"]
[null,null,null,null,64580,41124.520710117009,{"$f":"VLOOKUP(E3245,'[1]Combined AA and BB'!$A$1:$C$6133,3,FALSE)","v":"N"}]
[null,null,null,null,64581,11696.604323246591,{"$f":"VLOOKUP(E3246,'[1]Combined AA and BB'!$A$1:$C$6133,3,FALSE)","v":"N"}]
[null,null,null,null,64582,"Not covered","NA"]
[null,null,null,null,64583,"Not covered","NA"]
[null,null,null,null,64584,"Not covered","NA"]
[null,null,null,null,64585,3029.6059976255347,{"$f":"VLOOKUP(E3250,'[1]Combined AA and BB'!$A$1:$C$6133,3,FALSE)","v":"Y"}]
[null,null,null,null,64590,42438.995051133803,{"$f":"VLOOKUP(E3251,'[1]Combined AA and BB'!$A$1:$C$6133,3,FALSE)","v":"N"}]
[null,null,null,null,64595,5137.4477054482113,{"$f":"VLOOKUP(E3252,'[1]Combined AA and BB'!$A$1:$C$6133,3,FALSE)","v":"Y"}]
[null,null,null,null,64600,740.24931776998312,{"$f":"VLOOKUP(E3253,'[1]Combined AA and BB'!$A$1:$C$6133,3,FALSE)","v":"Y"}]
[null,null,null,null,64605,1424.7621552558512,{"$f":"VLOOKUP(E3254,'[1]Combined AA and BB'!$A$1:$C$6133,3,FALSE)","v":"Y"}]
[null,null,null,null,64610,1424.7621552558512,{"$f":"VLOOKUP(E3255,'[1]Combined AA and BB'!$A$1:$C$6133,3,FALSE)","v":"Y"}]
[null,null,null,null,64611,239.35079999999996,{"$f":"VLOOKUP(E3256,'[1]Combined AA and BB'!$A$1:$C$6133,3,FALSE)","v":"Y"}]
[null,null,null,null,64612,251.85420000000002,{"$f":"VLOOKUP(E3257,'[1]Combined AA and BB'!$A$1:$C$6133,3,FALSE)","v":"Y"}]
[null,null,null,null,64615,278.6472,{"$f":"VLOOKUP(E3258,'[1]Combined AA and BB'!$A$1:$C$6133,3,FALSE)","v":"Y"}]
[null,null,null,null,64616,248.87719999999999,{"$f":"VLOOKUP(E3259,'[1]Combined AA and BB'!$A$1:$C$6133,3,FALSE)","v":"Y"}]
[null,null,null,null,64617,301.86779999999999,{"$f":"VLOOKUP(E3260,'[1]Combined AA and BB'!$A$1:$C$6133,3,FALSE)","v":"Y"}]
[null,null,null,null,64620,740.24931776998312,{"$f":"VLOOKUP(E3261,'[1]Combined AA and BB'!$A$1:$C$6133,3,FALSE)","v":"Y"}]
[null,null,null,null,64624,"Not covered","NA"]
[null,null,null,null,64625,"Not covered","NA"]
[null,null,null,null,64628,"Not covered","NA"]
[null,null,null,null,64630,740.24931776998312,{"$f":"VLOOKUP(E3265,'[1]Combined AA and BB'!$A$1:$C$6133,3,FALSE)","v":"Y"}]
[null,null,null,null,64632,165.52119999999999,{"$f":"VLOOKUP(E3266,'[1]Combined AA and BB'!$A$1:$C$6133,3,FALSE)","v":"Y"}]
[null,null,null,null,64633,1424.7621552558512,{"$f":"VLOOKUP(E3267,'[1]Combined AA and BB'!$A$1:$C$6133,3,FALSE)","v":"Y"}]
[null,null,null,null,64634,"Bundled","NA"]
[null,null,null,null,64635,1424.7621552558512,{"$f":"VLOOKUP(E3269,'[1]Combined AA and BB'!$A$1:$C$6133,3,FALSE)","v":"Y"}]
[null,null,null,null,64636,"Bundled","NA"]
[null,null,null,null,64640,462.03039999999999,{"$f":"VLOOKUP(E3271,'[1]Combined AA and BB'!$A$1:$C$6133,3,FALSE)","v":"Y"}]
[null,null,null,null,64642,276.26559999999995,{"$f":"VLOOKUP(E3272,'[1]Combined AA and BB'!$A$1:$C$6133,3,FALSE)","v":"Y"}]
[null,null,null,null,64643,"Bundled","NA"]
[null,null,null,null,64644,324.49299999999999,{"$f":"VLOOKUP(E3274,'[1]Combined AA and BB'!$A$1:$C$6133,3,FALSE)","v":"Y"}]
[null,null,null,null,64645,"Bundled","NA"]
[null,null,null,null,64646,291.1506,{"$f":"VLOOKUP(E3276,'[1]Combined AA and BB'!$A$1:$C$6133,3,FALSE)","v":"Y"}]
[null,null,null,null,64647,332.23320000000001,{"$f":"VLOOKUP(E3277,'[1]Combined AA and BB'!$A$1:$C$6133,3,FALSE)","v":"Y"}]
[null,null,null,null,64650,166.11660000000001,{"$f":"VLOOKUP(E3278,'[1]Combined AA and BB'!$A$1:$C$6133,3,FALSE)","v":"Y"}]
[null,null,null,null,64653,194.69579999999999,{"$f":"VLOOKUP(E3279,'[1]Combined AA and BB'!$A$1:$C$6133,3,FALSE)","v":"Y"}]
[null,null,null,null,64680,740.24931776998312,{"$f":"VLOOKUP(E3280,'[1]Combined AA and BB'!$A$1:$C$6133,3,FALSE)","v":"Y"}]
[null,null,null,null,64681,740.24931776998312,{"$f":"VLOOKUP(E3281,'[1]Combined AA and BB'!$A$1:$C$6133,3,FALSE)","v":"Y"}]
[null,null,null,null,64702,1424.7621552558512,{"$f":"VLOOKUP(E3282,'[1]Combined AA and BB'!$A$1:$C$6133,3,FALSE)","v":"Y"}]
[null,null,null,null,64704,1424.7621552558512,{"$f":"VLOOKUP(E3283,'[1]Combined AA and BB'!$A$1:$C$6133,3,FALSE)","v":"Y"}]
[null,null,null,null,64708,1424.7621552558512,{"$f":"VLOOKUP(E3284,'[1]Combined AA and BB'!$A$1:$C$6133,3,FALSE)","v":"Y"}]
[null,null,null,null,64712,1424.7621552558512,{"$f":"VLOOKUP(E3285,'[1]Combined AA and BB'!$A$1:$C$6133,3,FALSE)","v":"Y"}]
[null,null,null,null,64713,1424.7621552558512,{"$f":"VLOOKUP(E3286,'[1]Combined AA and BB'!$A$1:$C$6133,3,FALSE)","v":"Y"}]
[null,null,null,null,64714,1424.7621552558512,{"$f":"VLOOKUP(E3287,'[1]Combined AA and BB'!$A$1:$C$6133,3,FALSE)","v":"Y"}]
[null,null,null,null,64716,2850.2359446694099,{"$f":"VLOOKUP(E3288,'[1]Combined AA and BB'!$A$1:$C$6133,3,FALSE)","v":"Y"}]
[null,null,null,null,64718,1424.7621552558512,{"$f":"VLOOKUP(E3289,'[1]Combined AA and BB'!$A$1:$C$6133,3,FALSE)","v":"Y"}]
[null,null,null,null,64719,1424.7621552558512,{"$f":"VLOOKUP(E3290,'[1]Combined AA and BB'!$A$1:$C$6133,3,FALSE)","v":"Y"}]
[null,null,null,null,64721,1424.7621552558512,{"$f":"VLOOKUP(E3291,'[1]Combined AA and BB'!$A$1:$C$6133,3,FALSE)","v":"Y"}]
[null,null,null,null,64722,1424.7621552558512,{"$f":"VLOOKUP(E3292,'[1]Combined AA and BB'!$A$1:$C$6133,3,FALSE)","v":"Y"}]
[null,null,null,null,64726,1424.7621552558512,{"$f":"VLOOKUP(E3293,'[1]Combined AA and BB'!$A$1:$C$6133,3,FALSE)","v":"Y"}]
[null,null,null,null,64727,"Bundled","NA"]
[null,null,null,null,64732,1424.7621552558512,{"$f":"VLOOKUP(E3295,'[1]Combined AA and BB'!$A$1:$C$6133,3,FALSE)","v":"Y"}]
[null,null,null,null,64734,1424.7621552558512,{"$f":"VLOOKUP(E3296,'[1]Combined AA and BB'!$A$1:$C$6133,3,FALSE)","v":"Y"}]
[null,null,null,null,64736,1424.7621552558512,{"$f":"VLOOKUP(E3297,'[1]Combined AA and BB'!$A$1:$C$6133,3,FALSE)","v":"Y"}]
[null,null,null,null,64738,1424.7621552558512,{"$f":"VLOOKUP(E3298,'[1]Combined AA and BB'!$A$1:$C$6133,3,FALSE)","v":"Y"}]
[null,null,null,null,64740,1424.7621552558512,{"$f":"VLOOKUP(E3299,'[1]Combined AA and BB'!$A$1:$C$6133,3,FALSE)","v":"Y"}]
[null,null,null,null,64742,1424.7621552558512,{"$f":"VLOOKUP(E3300,'[1]Combined AA and BB'!$A$1:$C$6133,3,FALSE)","v":"Y"}]
[null,null,null,null,64744,1424.7621552558512,{"$f":"VLOOKUP(E3301,'[1]Combined AA and BB'!$A$1:$C$6133,3,FALSE)","v":"Y"}]
[null,null,null,null,64746,1424.7621552558512,{"$f":"VLOOKUP(E3302,'[1]Combined AA and BB'!$A$1:$C$6133,3,FALSE)","v":"Y"}]
[null,null,null,null,64763,1424.7621552558512,{"$f":"VLOOKUP(E3303,'[1]Combined AA and BB'!$A$1:$C$6133,3,FALSE)","v":"Y"}]
[null,null,null,null,64766,1424.7621552558512,{"$f":"VLOOKUP(E3304,'[1]Combined AA and BB'!$A$1:$C$6133,3,FALSE)","v":"Y"}]
[null,null,null,null,64771,1424.7621552558512,{"$f":"VLOOKUP(E3305,'[1]Combined AA and BB'!$A$1:$C$6133,3,FALSE)","v":"Y"}]
[null,null,null,null,64772,1424.7621552558512,{"$f":"VLOOKUP(E3306,'[1]Combined AA and BB'!$A$1:$C$6133,3,FALSE)","v":"Y"}]
[null,null,null,null,64774,1424.7621552558512,{"$f":"VLOOKUP(E3307,'[1]Combined AA and BB'!$A$1:$C$6133,3,FALSE)","v":"Y"}]
[null,null,null,null,64776,1424.7621552558512,{"$f":"VLOOKUP(E3308,'[1]Combined AA and BB'!$A$1:$C$6133,3,FALSE)","v":"Y"}]
[null,null,null,null,64778,"Bundled","NA"]
[null,null,null,null,64782,1424.7621552558512,{"$f":"VLOOKUP(E3310,'[1]Combined AA and BB'!$A$1:$C$6133,3,FALSE)","v":"Y"}]
[null,null,null,null,64783,"Bundled","NA"]
[null,null,null,null,64784,1424.7621552558512,{"$f":"VLOOKUP(E3312,'[1]Combined AA and BB'!$A$1:$C$6133,3,FALSE)","v":"Y"}]
[null,null,null,null,64786,4390.2750933710631,{"$f":"VLOOKUP(E3313,'[1]Combined AA and BB'!$A$1:$C$6133,3,FALSE)","v":"Y"}]
[null,null,null,null,64787,"Bundled","NA"]
[null,null,null,null,64788,1424.7621552558512,{"$f":"VLOOKUP(E3315,'[1]Combined AA and BB'!$A$1:$C$6133,3,FALSE)","v":"Y"}]
[null,null,null,null,64790,1424.7621552558512,{"$f":"VLOOKUP(E3316,'[1]Combined AA and BB'!$A$1:$C$6133,3,FALSE)","v":"Y"}]
[null,null,null,null,64792,4390.2750933710631,{"$f":"VLOOKUP(E3317,'[1]Combined AA and BB'!$A$1:$C$6133,3,FALSE)","v":"Y"}]
[null,null,null,null,64795,1424.7621552558512,{"$f":"VLOOKUP(E3318,'[1]Combined AA and BB'!$A$1:$C$6133,3,FALSE)","v":"Y"}]
[null,null,null,null,64802,2409.6533576191555,{"$f":"VLOOKUP(E3319,'[1]Combined AA and BB'!$A$1:$C$6133,3,FALSE)","v":"Y"}]
[null,null,null,null,64820,1424.7621552558512,{"$f":"VLOOKUP(E3320,'[1]Combined AA and BB'!$A$1:$C$6133,3,FALSE)","v":"Y"}]
[null,null,null,null,64821,2360.4308567939793,{"$f":"VLOOKUP(E3321,'[1]Combined AA and BB'!$A$1:$C$6133,3,FALSE)","v":"Y"}]
[null,null,null,null,64822,2360.4308567939793,{"$f":"VLOOKUP(E3322,'[1]Combined AA and BB'!$A$1:$C$6133,3,FALSE)","v":"Y"}]
[null,null,null,null,64823,2360.4308567939793,{"$f":"VLOOKUP(E3323,'[1]Combined AA and BB'!$A$1:$C$6133,3,FALSE)","v":"Y"}]
[null,null,null,null,64831,1424.7621552558512,{"$f":"VLOOKUP(E3324,'[1]Combined AA and BB'!$A$1:$C$6133,3,FALSE)","v":"Y"}]
[null,null,null,null,64832,"Bundled","NA"]
[null,null,null,null,64834,4390.2750933710631,{"$f":"VLOOKUP(E3326,'[1]Combined AA and BB'!$A$1:$C$6133,3,FALSE)","v":"Y"}]
[null,null,null,null,64835,4390.2750933710631,{"$f":"VLOOKUP(E3327,'[1]Combined AA and BB'!$A$1:$C$6133,3,FALSE)","v":"Y"}]
[null,null,null,null,64836,4390.2750933710631,{"$f":"VLOOKUP(E3328,'[1]Combined AA and BB'!$A$1:$C$6133,3,FALSE)","v":"Y"}]
[null,null,null,null,64837,"Bundled","NA"]
[null,null,null,null,64840,4390.2750933710631,{"$f":"VLOOKUP(E3330,'[1]Combined AA and BB'!$A$1:$C$6133,3,FALSE)","v":"Y"}]
[null,null,null,null,64856,4390.2750933710631,{"$f":"VLOOKUP(E3331,'[1]Combined AA and BB'!$A$1:$C$6133,3,FALSE)","v":"Y"}]
[null,null,null,null,64857,4390.2750933710631,{"$f":"VLOOKUP(E3332,'[1]Combined AA and BB'!$A$1:$C$6133,3,FALSE)","v":"Y"}]
[null,null,null,null,64858,3250.4220245906863,{"$f":"VLOOKUP(E3333,'[1]Combined AA and BB'!$A$1:$C$6133,3,FALSE)","v":"Y"}]
[null,null,null,null,64859,"Bundled","NA"]
[null,null,null,null,64861,1424.7621552558512,{"$f":"VLOOKUP(E3335,'[1]Combined AA and BB'!$A$1:$C$6133,3,FALSE)","v":"Y"}]
[null,null,null,null,64862,4390.2750933710631,{"$f":"VLOOKUP(E3336,'[1]Combined AA and BB'!$A$1:$C$6133,3,FALSE)","v":"Y"}]
[null,null,null,null,64864,4390.2750933710631,{"$f":"VLOOKUP(E3337,'[1]Combined AA and BB'!$A$1:$C$6133,3,FALSE)","v":"Y"}]
[null,null,null,null,64865,7425.1489139042606,{"$f":"VLOOKUP(E3338,'[1]Combined AA and BB'!$A$1:$C$6133,3,FALSE)","v":"Y"}]
[null,null,null,null,64872,"Bundled","NA"]
[null,null,null,null,64874,"Bundled","NA"]
[null,null,null,null,64876,"Bundled","NA"]
[null,null,null,null,64885,4390.2750933710631,{"$f":"VLOOKUP(E3342,'[1]Combined AA and BB'!$A$1:$C$6133,3,FALSE)","v":"Y"}]
[null,null,null,null,64886,9603.7488203509383,{"$f":"VLOOKUP(E3343,'[1]Combined AA and BB'!$A$1:$C$6133,3,FALSE)","v":"Y"}]
[null,null,null,null,64890,4390.2750933710631,{"$f":"VLOOKUP(E3344,'[1]Combined AA and BB'!$A$1:$C$6133,3,FALSE)","v":"Y"}]
[null,null,null,null,64891,7425.1489139042606,{"$f":"VLOOKUP(E3345,'[1]Combined AA and BB'!$A$1:$C$6133,3,FALSE)","v":"Y"}]
[null,null,null,null,64892,7425.1489139042606,{"$f":"VLOOKUP(E3346,'[1]Combined AA and BB'!$A$1:$C$6133,3,FALSE)","v":"Y"}]
[null,null,null,null,64893,7425.1489139042606,{"$f":"VLOOKUP(E3347,'[1]Combined AA and BB'!$A$1:$C$6133,3,FALSE)","v":"Y"}]
[null,null,null,null,64895,4390.2750933710631,{"$f":"VLOOKUP(E3348,'[1]Combined AA and BB'!$A$1:$C$6133,3,FALSE)","v":"Y"}]
[null,null,null,null,64896,4390.2750933710631,{"$f":"VLOOKUP(E3349,'[1]Combined AA and BB'!$A$1:$C$6133,3,FALSE)","v":"Y"}]
[null,null,null,null,64897,8033.9990593900393,{"$f":"VLOOKUP(E3350,'[1]Combined AA and BB'!$A$1:$C$6133,3,FALSE)","v":"Y"}]
[null,null,null,null,64898,4390.2750933710631,{"$f":"VLOOKUP(E3351,'[1]Combined AA and BB'!$A$1:$C$6133,3,FALSE)","v":"Y"}]
[null,null,null,null,64901,"Bundled","NA"]
[null,null,null,null,64902,"Bundled","NA"]
[null,null,null,null,64905,4390.2750933710631,{"$f":"VLOOKUP(E3354,'[1]Combined AA and BB'!$A$1:$C$6133,3,FALSE)","v":"Y"}]
[null,null,null,null,64907,4390.2750933710631,{"$f":"VLOOKUP(E3355,'[1]Combined AA and BB'!$A$1:$C$6133,3,FALSE)","v":"Y"}]
[null,null,null,null,64910,8351.4570993526195,{"$f":"VLOOKUP(E3356,'[1]Combined AA and BB'!$A$1:$C$6133,3,FALSE)","v":"Y"}]
[null,null,null,null,64912,8906.6273553990486,{"$f":"VLOOKUP(E3357,'[1]Combined AA and BB'!$A$1:$C$6133,3,FALSE)","v":"Y"}]
[null,null,null,null,64913,"Bundled","NA"]
[null,null,null,null,65091,2347.2990894385102,{"$f":"VLOOKUP(E3359,'[1]Combined AA and BB'!$A$1:$C$6133,3,FALSE)","v":"Y"}]
[null,null,null,null,65093,2347.2990894385102,{"$f":"VLOOKUP(E3360,'[1]Combined AA and BB'!$A$1:$C$6133,3,FALSE)","v":"Y"}]
[null,null,null,null,65101,2347.2990894385102,{"$f":"VLOOKUP(E3361,'[1]Combined AA and BB'!$A$1:$C$6133,3,FALSE)","v":"Y"}]
[null,null,null,null,65103,2347.2990894385102,{"$f":"VLOOKUP(E3362,'[1]Combined AA and BB'!$A$1:$C$6133,3,FALSE)","v":"Y"}]
[null,null,null,null,65105,2347.2990894385102,{"$f":"VLOOKUP(E3363,'[1]Combined AA and BB'!$A$1:$C$6133,3,FALSE)","v":"Y"}]
[null,null,null,null,65110,2347.2990894385102,{"$f":"VLOOKUP(E3364,'[1]Combined AA and BB'!$A$1:$C$6133,3,FALSE)","v":"Y"}]
[null,null,null,null,65112,2347.2990894385102,{"$f":"VLOOKUP(E3365,'[1]Combined AA and BB'!$A$1:$C$6133,3,FALSE)","v":"Y"}]
[null,null,null,null,65114,2347.2990894385102,{"$f":"VLOOKUP(E3366,'[1]Combined AA and BB'!$A$1:$C$6133,3,FALSE)","v":"Y"}]
[null,null,null,null,65125,1507.2639110326018,{"$f":"VLOOKUP(E3367,'[1]Combined AA and BB'!$A$1:$C$6133,3,FALSE)","v":"Y"}]
[null,null,null,null,65130,2347.2990894385102,{"$f":"VLOOKUP(E3368,'[1]Combined AA and BB'!$A$1:$C$6133,3,FALSE)","v":"Y"}]
[null,null,null,null,65135,2347.2990894385102,{"$f":"VLOOKUP(E3369,'[1]Combined AA and BB'!$A$1:$C$6133,3,FALSE)","v":"Y"}]
[null,null,null,null,65140,2347.2990894385102,{"$f":"VLOOKUP(E3370,'[1]Combined AA and BB'!$A$1:$C$6133,3,FALSE)","v":"Y"}]
[null,null,null,null,65150,2347.2990894385102,{"$f":"VLOOKUP(E3371,'[1]Combined AA and BB'!$A$1:$C$6133,3,FALSE)","v":"Y"}]
[null,null,null,null,65155,2347.2990894385102,{"$f":"VLOOKUP(E3372,'[1]Combined AA and BB'!$A$1:$C$6133,3,FALSE)","v":"Y"}]
[null,null,null,null,65175,2347.2990894385102,{"$f":"VLOOKUP(E3373,'[1]Combined AA and BB'!$A$1:$C$6133,3,FALSE)","v":"Y"}]
[null,null,null,null,65205,"Bundled","NA"]
[null,null,null,null,65210,"Bundled","NA"]
[null,null,null,null,65220,"Bundled","NA"]
[null,null,null,null,65222,"Bundled","NA"]
[null,null,null,null,65235,1837.0719679675519,{"$f":"VLOOKUP(E3378,'[1]Combined AA and BB'!$A$1:$C$6133,3,FALSE)","v":"Y"}]
[null,null,null,null,65260,1837.0719679675519,{"$f":"VLOOKUP(E3379,'[1]Combined AA and BB'!$A$1:$C$6133,3,FALSE)","v":"Y"}]
[null,null,null,null,65265,1837.0719679675519,{"$f":"VLOOKUP(E3380,'[1]Combined AA and BB'!$A$1:$C$6133,3,FALSE)","v":"Y"}]
[null,null,null,null,65270,1507.2639110326018,{"$f":"VLOOKUP(E3381,'[1]Combined AA and BB'!$A$1:$C$6133,3,FALSE)","v":"Y"}]
[null,null,null,null,65272,1507.2639110326018,{"$f":"VLOOKUP(E3382,'[1]Combined AA and BB'!$A$1:$C$6133,3,FALSE)","v":"Y"}]
[null,null,null,null,65275,2347.2990894385102,{"$f":"VLOOKUP(E3383,'[1]Combined AA and BB'!$A$1:$C$6133,3,FALSE)","v":"Y"}]
[null,null,null,null,65280,3284.6633287906516,{"$f":"VLOOKUP(E3384,'[1]Combined AA and BB'!$A$1:$C$6133,3,FALSE)","v":"Y"}]
[null,null,null,null,65285,3284.6633287906516,{"$f":"VLOOKUP(E3385,'[1]Combined AA and BB'!$A$1:$C$6133,3,FALSE)","v":"Y"}]
[null,null,null,null,65286,1297.3765999999998,{"$f":"VLOOKUP(E3386,'[1]Combined AA and BB'!$A$1:$C$6133,3,FALSE)","v":"Y"}]
[null,null,null,null,65290,2347.2990894385102,{"$f":"VLOOKUP(E3387,'[1]Combined AA and BB'!$A$1:$C$6133,3,FALSE)","v":"Y"}]
[null,null,null,null,65400,758.02651270772276,{"$f":"VLOOKUP(E3388,'[1]Combined AA and BB'!$A$1:$C$6133,3,FALSE)","v":"Y"}]
[null,null,null,null,65410,1507.2639110326018,{"$f":"VLOOKUP(E3389,'[1]Combined AA and BB'!$A$1:$C$6133,3,FALSE)","v":"Y"}]
[null,null,null,null,65420,1507.2639110326018,{"$f":"VLOOKUP(E3390,'[1]Combined AA and BB'!$A$1:$C$6133,3,FALSE)","v":"Y"}]
[null,null,null,null,65426,1507.2639110326018,{"$f":"VLOOKUP(E3391,'[1]Combined AA and BB'!$A$1:$C$6133,3,FALSE)","v":"Y"}]
[null,null,null,null,65430,"Bundled","NA"]
[null,null,null,null,65435,151.827,{"$f":"VLOOKUP(E3393,'[1]Combined AA and BB'!$A$1:$C$6133,3,FALSE)","v":"Y"}]
[null,null,null,null,65436,709.12139999999999,{"$f":"VLOOKUP(E3394,'[1]Combined AA and BB'!$A$1:$C$6133,3,FALSE)","v":"Y"}]
[null,null,null,null,65450,229.94433997083033,{"$f":"VLOOKUP(E3395,'[1]Combined AA and BB'!$A$1:$C$6133,3,FALSE)","v":"Y"}]
[null,null,null,null,65600,812.12560000000008,{"$f":"VLOOKUP(E3396,'[1]Combined AA and BB'!$A$1:$C$6133,3,FALSE)","v":"Y"}]
[null,null,null,null,65710,3284.6633287906516,{"$f":"VLOOKUP(E3397,'[1]Combined AA and BB'!$A$1:$C$6133,3,FALSE)","v":"Y"}]
[null,null,null,null,65730,3284.6633287906516,{"$f":"VLOOKUP(E3398,'[1]Combined AA and BB'!$A$1:$C$6133,3,FALSE)","v":"Y"}]
[null,null,null,null,65750,3284.6633287906516,{"$f":"VLOOKUP(E3399,'[1]Combined AA and BB'!$A$1:$C$6133,3,FALSE)","v":"Y"}]
[null,null,null,null,65755,3284.6633287906516,{"$f":"VLOOKUP(E3400,'[1]Combined AA and BB'!$A$1:$C$6133,3,FALSE)","v":"Y"}]
[null,null,null,null,65756,3284.6633287906516,{"$f":"VLOOKUP(E3401,'[1]Combined AA and BB'!$A$1:$C$6133,3,FALSE)","v":"Y"}]
[null,null,null,null,65770,15843.261957395314,{"$f":"VLOOKUP(E3402,'[1]Combined AA and BB'!$A$1:$C$6133,3,FALSE)","v":"Y"}]
[null,null,null,null,65772,758.02651270772276,{"$f":"VLOOKUP(E3403,'[1]Combined AA and BB'!$A$1:$C$6133,3,FALSE)","v":"Y"}]
[null,null,null,null,65775,1507.2639110326018,{"$f":"VLOOKUP(E3404,'[1]Combined AA and BB'!$A$1:$C$6133,3,FALSE)","v":"Y"}]
[null,null,null,null,65778,"Bundled","NA"]
[null,null,null,null,65779,"Bundled","NA"]
[null,null,null,null,65780,3964.2302405854271,{"$f":"VLOOKUP(E3407,'[1]Combined AA and BB'!$A$1:$C$6133,3,FALSE)","v":"Y"}]
[null,null,null,null,65781,6698.26220067334,{"$f":"VLOOKUP(E3408,'[1]Combined AA and BB'!$A$1:$C$6133,3,FALSE)","v":"Y"}]
[null,null,null,null,65782,2347.2990894385102,{"$f":"VLOOKUP(E3409,'[1]Combined AA and BB'!$A$1:$C$6133,3,FALSE)","v":"Y"}]
[null,null,null,null,65785,4121.3588,{"$f":"VLOOKUP(E3410,'[1]Combined AA and BB'!$A$1:$C$6133,3,FALSE)","v":"Y"}]
[null,null,null,null,65800,1837.0719679675519,{"$f":"VLOOKUP(E3411,'[1]Combined AA and BB'!$A$1:$C$6133,3,FALSE)","v":"Y"}]
[null,null,null,null,65810,1837.0719679675519,{"$f":"VLOOKUP(E3412,'[1]Combined AA and BB'!$A$1:$C$6133,3,FALSE)","v":"Y"}]
[null,null,null,null,65815,1837.0719679675519,{"$f":"VLOOKUP(E3413,'[1]Combined AA and BB'!$A$1:$C$6133,3,FALSE)","v":"Y"}]
[null,null,null,null,65820,3284.6633287906516,{"$f":"VLOOKUP(E3414,'[1]Combined AA and BB'!$A$1:$C$6133,3,FALSE)","v":"Y"}]
[null,null,null,null,65850,1837.0719679675519,{"$f":"VLOOKUP(E3415,'[1]Combined AA and BB'!$A$1:$C$6133,3,FALSE)","v":"Y"}]
[null,null,null,null,65855,450.12239999999997,{"$f":"VLOOKUP(E3416,'[1]Combined AA and BB'!$A$1:$C$6133,3,FALSE)","v":"Y"}]
[null,null,null,null,65860,565.03459999999995,{"$f":"VLOOKUP(E3417,'[1]Combined AA and BB'!$A$1:$C$6133,3,FALSE)","v":"Y"}]
[null,null,null,null,65865,1837.0719679675519,{"$f":"VLOOKUP(E3418,'[1]Combined AA and BB'!$A$1:$C$6133,3,FALSE)","v":"Y"}]
[null,null,null,null,65870,1837.0719679675519,{"$f":"VLOOKUP(E3419,'[1]Combined AA and BB'!$A$1:$C$6133,3,FALSE)","v":"Y"}]
[null,null,null,null,65875,1837.0719679675519,{"$f":"VLOOKUP(E3420,'[1]Combined AA and BB'!$A$1:$C$6133,3,FALSE)","v":"Y"}]
[null,null,null,null,65880,3284.6633287906516,{"$f":"VLOOKUP(E3421,'[1]Combined AA and BB'!$A$1:$C$6133,3,FALSE)","v":"Y"}]
[null,null,null,null,65900,1837.0719679675519,{"$f":"VLOOKUP(E3422,'[1]Combined AA and BB'!$A$1:$C$6133,3,FALSE)","v":"Y"}]
[null,null,null,null,65920,1837.0719679675519,{"$f":"VLOOKUP(E3423,'[1]Combined AA and BB'!$A$1:$C$6133,3,FALSE)","v":"Y"}]
[null,null,null,null,65930,1837.0719679675519,{"$f":"VLOOKUP(E3424,'[1]Combined AA and BB'!$A$1:$C$6133,3,FALSE)","v":"Y"}]
[null,null,null,null,66020,1837.0719679675519,{"$f":"VLOOKUP(E3425,'[1]Combined AA and BB'!$A$1:$C$6133,3,FALSE)","v":"Y"}]
[null,null,null,null,66030,1837.0719679675519,{"$f":"VLOOKUP(E3426,'[1]Combined AA and BB'!$A$1:$C$6133,3,FALSE)","v":"Y"}]
[null,null,null,null,66130,1507.2639110326018,{"$f":"VLOOKUP(E3427,'[1]Combined AA and BB'!$A$1:$C$6133,3,FALSE)","v":"Y"}]
[null,null,null,null,66150,3284.6633287906516,{"$f":"VLOOKUP(E3428,'[1]Combined AA and BB'!$A$1:$C$6133,3,FALSE)","v":"Y"}]
[null,null,null,null,66155,6115.8080822464781,{"$f":"VLOOKUP(E3429,'[1]Combined AA and BB'!$A$1:$C$6133,3,FALSE)","v":"Y"}]
[null,null,null,null,66160,1837.0719679675519,{"$f":"VLOOKUP(E3430,'[1]Combined AA and BB'!$A$1:$C$6133,3,FALSE)","v":"Y"}]
[null,null,null,null,66170,1837.0719679675519,{"$f":"VLOOKUP(E3431,'[1]Combined AA and BB'!$A$1:$C$6133,3,FALSE)","v":"Y"}]
[null,null,null,null,66172,1837.0719679675519,{"$f":"VLOOKUP(E3432,'[1]Combined AA and BB'!$A$1:$C$6133,3,FALSE)","v":"Y"}]
[null,null,null,null,66174,3284.6633287906516,{"$f":"VLOOKUP(E3433,'[1]Combined AA and BB'!$A$1:$C$6133,3,FALSE)","v":"Y"}]
[null,null,null,null,66175,5555.2425192462215,{"$f":"VLOOKUP(E3434,'[1]Combined AA and BB'!$A$1:$C$6133,3,FALSE)","v":"Y"}]
[null,null,null,null,66179,5599.4066352395821,{"$f":"VLOOKUP(E3435,'[1]Combined AA and BB'!$A$1:$C$6133,3,FALSE)","v":"Y"}]
[null,null,null,null,66180,5731.4892130712688,{"$f":"VLOOKUP(E3436,'[1]Combined AA and BB'!$A$1:$C$6133,3,FALSE)","v":"Y"}]
[null,null,null,null,66183,"Not covered","NA"]
[null,null,null,null,66184,1837.0719679675519,{"$f":"VLOOKUP(E3438,'[1]Combined AA and BB'!$A$1:$C$6133,3,FALSE)","v":"Y"}]
[null,null,null,null,66185,1837.0719679675519,{"$f":"VLOOKUP(E3439,'[1]Combined AA and BB'!$A$1:$C$6133,3,FALSE)","v":"Y"}]
[null,null,null,null,66225,3284.6633287906516,{"$f":"VLOOKUP(E3440,'[1]Combined AA and BB'!$A$1:$C$6133,3,FALSE)","v":"Y"}]
[null,null,null,null,66250,1507.2639110326018,{"$f":"VLOOKUP(E3441,'[1]Combined AA and BB'!$A$1:$C$6133,3,FALSE)","v":"Y"}]
[null,null,null,null,66500,1837.0719679675519,{"$f":"VLOOKUP(E3442,'[1]Combined AA and BB'!$A$1:$C$6133,3,FALSE)","v":"Y"}]
[null,null,null,null,66505,1837.0719679675519,{"$f":"VLOOKUP(E3443,'[1]Combined AA and BB'!$A$1:$C$6133,3,FALSE)","v":"Y"}]
[null,null,null,null,66600,3284.6633287906516,{"$f":"VLOOKUP(E3444,'[1]Combined AA and BB'!$A$1:$C$6133,3,FALSE)","v":"Y"}]
[null,null,null,null,66605,1837.0719679675519,{"$f":"VLOOKUP(E3445,'[1]Combined AA and BB'!$A$1:$C$6133,3,FALSE)","v":"Y"}]
[null,null,null,null,66625,1837.0719679675519,{"$f":"VLOOKUP(E3446,'[1]Combined AA and BB'!$A$1:$C$6133,3,FALSE)","v":"Y"}]
[null,null,null,null,66630,1837.0719679675519,{"$f":"VLOOKUP(E3447,'[1]Combined AA and BB'!$A$1:$C$6133,3,FALSE)","v":"Y"}]
[null,null,null,null,66635,1837.0719679675519,{"$f":"VLOOKUP(E3448,'[1]Combined AA and BB'!$A$1:$C$6133,3,FALSE)","v":"Y"}]
[null,null,null,null,66680,1837.0719679675519,{"$f":"VLOOKUP(E3449,'[1]Combined AA and BB'!$A$1:$C$6133,3,FALSE)","v":"Y"}]
[null,null,null,null,66682,1837.0719679675519,{"$f":"VLOOKUP(E3450,'[1]Combined AA and BB'!$A$1:$C$6133,3,FALSE)","v":"Y"}]
[null,null,null,null,66700,1837.0719679675519,{"$f":"VLOOKUP(E3451,'[1]Combined AA and BB'!$A$1:$C$6133,3,FALSE)","v":"Y"}]
[null,null,null,null,66710,1507.2639110326018,{"$f":"VLOOKUP(E3452,'[1]Combined AA and BB'!$A$1:$C$6133,3,FALSE)","v":"Y"}]
[null,null,null,null,66711,1837.0719679675519,{"$f":"VLOOKUP(E3453,'[1]Combined AA and BB'!$A$1:$C$6133,3,FALSE)","v":"Y"}]
[null,null,null,null,66720,1507.2639110326018,{"$f":"VLOOKUP(E3454,'[1]Combined AA and BB'!$A$1:$C$6133,3,FALSE)","v":"Y"}]
[null,null,null,null,66740,1507.2639110326018,{"$f":"VLOOKUP(E3455,'[1]Combined AA and BB'!$A$1:$C$6133,3,FALSE)","v":"Y"}]
[null,null,null,null,66761,553.72199999999998,{"$f":"VLOOKUP(E3456,'[1]Combined AA and BB'!$A$1:$C$6133,3,FALSE)","v":"Y"}]
[null,null,null,null,66762,878.21500000000003,{"$f":"VLOOKUP(E3457,'[1]Combined AA and BB'!$A$1:$C$6133,3,FALSE)","v":"Y"}]
[null,null,null,null,66770,461.05652486457785,{"$f":"VLOOKUP(E3458,'[1]Combined AA and BB'!$A$1:$C$6133,3,FALSE)","v":"Y"}]
[null,null,null,null,66820,1837.0719679675519,{"$f":"VLOOKUP(E3459,'[1]Combined AA and BB'!$A$1:$C$6133,3,FALSE)","v":"Y"}]
[null,null,null,null,66821,461.05652486457785,{"$f":"VLOOKUP(E3460,'[1]Combined AA and BB'!$A$1:$C$6133,3,FALSE)","v":"Y"}]
[null,null,null,null,66825,1837.0719679675519,{"$f":"VLOOKUP(E3461,'[1]Combined AA and BB'!$A$1:$C$6133,3,FALSE)","v":"Y"}]
[null,null,null,null,66830,1837.0719679675519,{"$f":"VLOOKUP(E3462,'[1]Combined AA and BB'!$A$1:$C$6133,3,FALSE)","v":"Y"}]
[null,null,null,null,66840,1837.0719679675519,{"$f":"VLOOKUP(E3463,'[1]Combined AA and BB'!$A$1:$C$6133,3,FALSE)","v":"Y"}]
[null,null,null,null,66850,1837.0719679675519,{"$f":"VLOOKUP(E3464,'[1]Combined AA and BB'!$A$1:$C$6133,3,FALSE)","v":"Y"}]
[null,null,null,null,66852,3284.6633287906516,{"$f":"VLOOKUP(E3465,'[1]Combined AA and BB'!$A$1:$C$6133,3,FALSE)","v":"Y"}]
[null,null,null,null,66920,1837.0719679675519,{"$f":"VLOOKUP(E3466,'[1]Combined AA and BB'!$A$1:$C$6133,3,FALSE)","v":"Y"}]
[null,null,null,null,66930,3284.6633287906516,{"$f":"VLOOKUP(E3467,'[1]Combined AA and BB'!$A$1:$C$6133,3,FALSE)","v":"Y"}]
[null,null,null,null,66940,1837.0719679675519,{"$f":"VLOOKUP(E3468,'[1]Combined AA and BB'!$A$1:$C$6133,3,FALSE)","v":"Y"}]
[null,null,null,null,66982,1837.0719679675519,{"$f":"VLOOKUP(E3469,'[1]Combined AA and BB'!$A$1:$C$6133,3,FALSE)","v":"Y"}]
[null,null,null,null,66983,1837.0719679675519,{"$f":"VLOOKUP(E3470,'[1]Combined AA and BB'!$A$1:$C$6133,3,FALSE)","v":"Y"}]
[null,null,null,null,66984,1837.0719679675519,{"$f":"VLOOKUP(E3471,'[1]Combined AA and BB'!$A$1:$C$6133,3,FALSE)","v":"Y"}]
[null,null,null,null,66985,1837.0719679675519,{"$f":"VLOOKUP(E3472,'[1]Combined AA and BB'!$A$1:$C$6133,3,FALSE)","v":"Y"}]
[null,null,null,null,66986,1837.0719679675519,{"$f":"VLOOKUP(E3473,'[1]Combined AA and BB'!$A$1:$C$6133,3,FALSE)","v":"Y"}]
[null,null,null,null,66987,3284.6633287906516,{"$f":"VLOOKUP(E3474,'[1]Combined AA and BB'!$A$1:$C$6133,3,FALSE)","v":"Y"}]
[null,null,null,null,66988,3284.6633287906516,{"$f":"VLOOKUP(E3475,'[1]Combined AA and BB'!$A$1:$C$6133,3,FALSE)","v":"Y"}]
[null,null,null,null,66989,"Not covered","NA"]
[null,null,null,null,66990,"Bundled","NA"]
[null,null,null,null,66991,"Not covered","NA"]
[null,null,null,null,67005,1837.0719679675519,{"$f":"VLOOKUP(E3479,'[1]Combined AA and BB'!$A$1:$C$6133,3,FALSE)","v":"Y"}]
[null,null,null,null,67010,1837.0719679675519,{"$f":"VLOOKUP(E3480,'[1]Combined AA and BB'!$A$1:$C$6133,3,FALSE)","v":"Y"}]
[null,null,null,null,67015,1837.0719679675519,{"$f":"VLOOKUP(E3481,'[1]Combined AA and BB'!$A$1:$C$6133,3,FALSE)","v":"Y"}]
[null,null,null,null,67025,1837.0719679675519,{"$f":"VLOOKUP(E3482,'[1]Combined AA and BB'!$A$1:$C$6133,3,FALSE)","v":"Y"}]
[null,null,null,null,67027,2848.0536909791408,{"$f":"VLOOKUP(E3483,'[1]Combined AA and BB'!$A$1:$C$6133,3,FALSE)","v":"Y"}]
[null,null,null,null,67028,207.7946,{"$f":"VLOOKUP(E3484,'[1]Combined AA and BB'!$A$1:$C$6133,3,FALSE)","v":"N"}]
[null,null,null,null,67030,1837.0719679675519,{"$f":"VLOOKUP(E3485,'[1]Combined AA and BB'!$A$1:$C$6133,3,FALSE)","v":"Y"}]
[null,null,null,null,67031,461.05652486457785,{"$f":"VLOOKUP(E3486,'[1]Combined AA and BB'!$A$1:$C$6133,3,FALSE)","v":"Y"}]
[null,null,null,null,67036,3284.6633287906516,{"$f":"VLOOKUP(E3487,'[1]Combined AA and BB'!$A$1:$C$6133,3,FALSE)","v":"Y"}]
[null,null,null,null,67039,3284.6633287906516,{"$f":"VLOOKUP(E3488,'[1]Combined AA and BB'!$A$1:$C$6133,3,FALSE)","v":"Y"}]
[null,null,null,null,67040,3284.6633287906516,{"$f":"VLOOKUP(E3489,'[1]Combined AA and BB'!$A$1:$C$6133,3,FALSE)","v":"Y"}]
[null,null,null,null,67041,3284.6633287906516,{"$f":"VLOOKUP(E3490,'[1]Combined AA and BB'!$A$1:$C$6133,3,FALSE)","v":"Y"}]
[null,null,null,null,67042,3284.6633287906516,{"$f":"VLOOKUP(E3491,'[1]Combined AA and BB'!$A$1:$C$6133,3,FALSE)","v":"Y"}]
[null,null,null,null,67043,3284.6633287906516,{"$f":"VLOOKUP(E3492,'[1]Combined AA and BB'!$A$1:$C$6133,3,FALSE)","v":"Y"}]
[null,null,null,null,67101,617.4298,{"$f":"VLOOKUP(E3493,'[1]Combined AA and BB'!$A$1:$C$6133,3,FALSE)","v":"Y"}]
[null,null,null,null,67105,544.19560000000001,{"$f":"VLOOKUP(E3494,'[1]Combined AA and BB'!$A$1:$C$6133,3,FALSE)","v":"Y"}]
[null,null,null,null,67107,3284.6633287906516,{"$f":"VLOOKUP(E3495,'[1]Combined AA and BB'!$A$1:$C$6133,3,FALSE)","v":"Y"}]
[null,null,null,null,67108,3284.6633287906516,{"$f":"VLOOKUP(E3496,'[1]Combined AA and BB'!$A$1:$C$6133,3,FALSE)","v":"Y"}]
[null,null,null,null,67110,1634.9684,{"$f":"VLOOKUP(E3497,'[1]Combined AA and BB'!$A$1:$C$6133,3,FALSE)","v":"Y"}]
[null,null,null,null,67113,3284.6633287906516,{"$f":"VLOOKUP(E3498,'[1]Combined AA and BB'!$A$1:$C$6133,3,FALSE)","v":"Y"}]
[null,null,null,null,67115,3284.6633287906516,{"$f":"VLOOKUP(E3499,'[1]Combined AA and BB'!$A$1:$C$6133,3,FALSE)","v":"Y"}]
[null,null,null,null,67120,1837.0719679675519,{"$f":"VLOOKUP(E3500,'[1]Combined AA and BB'!$A$1:$C$6133,3,FALSE)","v":"Y"}]
[null,null,null,null,67121,1837.0719679675519,{"$f":"VLOOKUP(E3501,'[1]Combined AA and BB'!$A$1:$C$6133,3,FALSE)","v":"Y"}]
[null,null,null,null,67141,229.94433997083033,{"$f":"VLOOKUP(E3502,'[1]Combined AA and BB'!$A$1:$C$6133,3,FALSE)","v":"Y"}]
[null,null,null,null,67145,447.74079999999998,{"$f":"VLOOKUP(E3503,'[1]Combined AA and BB'!$A$1:$C$6133,3,FALSE)","v":"Y"}]
[null,null,null,null,67208,229.94433997083033,{"$f":"VLOOKUP(E3504,'[1]Combined AA and BB'!$A$1:$C$6133,3,FALSE)","v":"Y"}]
[null,null,null,null,67210,943.11360000000002,{"$f":"VLOOKUP(E3505,'[1]Combined AA and BB'!$A$1:$C$6133,3,FALSE)","v":"Y"}]
[null,null,null,null,67218,"Not covered","NA"]
[null,null,null,null,67220,461.05652486457785,{"$f":"VLOOKUP(E3507,'[1]Combined AA and BB'!$A$1:$C$6133,3,FALSE)","v":"Y"}]
[null,null,null,null,67221,"Not covered","NA"]
[null,null,null,null,67225,"Not covered","NA"]
[null,null,null,null,67227,541.21860000000004,{"$f":"VLOOKUP(E3510,'[1]Combined AA and BB'!$A$1:$C$6133,3,FALSE)","v":"Y"}]
[null,null,null,null,67228,619.81140000000005,{"$f":"VLOOKUP(E3511,'[1]Combined AA and BB'!$A$1:$C$6133,3,FALSE)","v":"Y"}]
[null,null,null,null,67229,"Not covered","NA"]
[null,null,null,null,67250,1507.2639110326018,{"$f":"VLOOKUP(E3513,'[1]Combined AA and BB'!$A$1:$C$6133,3,FALSE)","v":"Y"}]
[null,null,null,null,67255,1837.0719679675519,{"$f":"VLOOKUP(E3514,'[1]Combined AA and BB'!$A$1:$C$6133,3,FALSE)","v":"Y"}]
[null,null,null,null,67311,1507.2639110326018,{"$f":"VLOOKUP(E3515,'[1]Combined AA and BB'!$A$1:$C$6133,3,FALSE)","v":"Y"}]
[null,null,null,null,67312,2347.2990894385102,{"$f":"VLOOKUP(E3516,'[1]Combined AA and BB'!$A$1:$C$6133,3,FALSE)","v":"Y"}]
[null,null,null,null,67314,1507.2639110326018,{"$f":"VLOOKUP(E3517,'[1]Combined AA and BB'!$A$1:$C$6133,3,FALSE)","v":"Y"}]
[null,null,null,null,67316,1507.2639110326018,{"$f":"VLOOKUP(E3518,'[1]Combined AA and BB'!$A$1:$C$6133,3,FALSE)","v":"Y"}]
[null,null,null,null,67318,1507.2639110326018,{"$f":"VLOOKUP(E3519,'[1]Combined AA and BB'!$A$1:$C$6133,3,FALSE)","v":"Y"}]
[null,null,null,null,67320,"Bundled","NA"]
[null,null,null,null,67331,"Bundled","NA"]
[null,null,null,null,67332,"Bundled","NA"]
[null,null,null,null,67334,"Bundled","NA"]
[null,null,null,null,67335,"Bundled","NA"]
[null,null,null,null,67340,"Bundled","NA"]
[null,null,null,null,67343,1507.2639110326018,{"$f":"VLOOKUP(E3526,'[1]Combined AA and BB'!$A$1:$C$6133,3,FALSE)","v":"Y"}]
[null,null,null,null,67345,441.78679999999997,{"$f":"VLOOKUP(E3527,'[1]Combined AA and BB'!$A$1:$C$6133,3,FALSE)","v":"Y"}]
[null,null,null,null,67346,2347.2990894385102,{"$f":"VLOOKUP(E3528,'[1]Combined AA and BB'!$A$1:$C$6133,3,FALSE)","v":"Y"}]
[null,null,null,null,67400,2347.2990894385102,{"$f":"VLOOKUP(E3529,'[1]Combined AA and BB'!$A$1:$C$6133,3,FALSE)","v":"Y"}]
[null,null,null,null,67405,1507.2639110326018,{"$f":"VLOOKUP(E3530,'[1]Combined AA and BB'!$A$1:$C$6133,3,FALSE)","v":"Y"}]
[null,null,null,null,67412,1507.2639110326018,{"$f":"VLOOKUP(E3531,'[1]Combined AA and BB'!$A$1:$C$6133,3,FALSE)","v":"Y"}]
[null,null,null,null,67413,1507.2639110326018,{"$f":"VLOOKUP(E3532,'[1]Combined AA and BB'!$A$1:$C$6133,3,FALSE)","v":"Y"}]
[null,null,null,null,67414,2347.2990894385102,{"$f":"VLOOKUP(E3533,'[1]Combined AA and BB'!$A$1:$C$6133,3,FALSE)","v":"Y"}]
[null,null,null,null,67415,"Not covered","NA"]
[null,null,null,null,67420,2347.2990894385102,{"$f":"VLOOKUP(E3535,'[1]Combined AA and BB'!$A$1:$C$6133,3,FALSE)","v":"Y"}]
[null,null,null,null,67430,2347.2990894385102,{"$f":"VLOOKUP(E3536,'[1]Combined AA and BB'!$A$1:$C$6133,3,FALSE)","v":"Y"}]
[null,null,null,null,67440,2347.2990894385102,{"$f":"VLOOKUP(E3537,'[1]Combined AA and BB'!$A$1:$C$6133,3,FALSE)","v":"Y"}]
[null,null,null,null,67445,2347.2990894385102,{"$f":"VLOOKUP(E3538,'[1]Combined AA and BB'!$A$1:$C$6133,3,FALSE)","v":"Y"}]
[null,null,null,null,67450,2347.2990894385102,{"$f":"VLOOKUP(E3539,'[1]Combined AA and BB'!$A$1:$C$6133,3,FALSE)","v":"Y"}]
[null,null,null,null,67500,139.3236,{"$f":"VLOOKUP(E3540,'[1]Combined AA and BB'!$A$1:$C$6133,3,FALSE)","v":"Y"}]
[null,null,null,null,67505,157.78100000000001,{"$f":"VLOOKUP(E3541,'[1]Combined AA and BB'!$A$1:$C$6133,3,FALSE)","v":"Y"}]
[null,null,null,null,67515,94.0732,{"$f":"VLOOKUP(E3542,'[1]Combined AA and BB'!$A$1:$C$6133,3,FALSE)","v":"Y"}]
[null,null,null,null,67550,2347.2990894385102,{"$f":"VLOOKUP(E3543,'[1]Combined AA and BB'!$A$1:$C$6133,3,FALSE)","v":"Y"}]
[null,null,null,null,67560,2347.2990894385102,{"$f":"VLOOKUP(E3544,'[1]Combined AA and BB'!$A$1:$C$6133,3,FALSE)","v":"Y"}]
[null,null,null,null,67570,2347.2990894385102,{"$f":"VLOOKUP(E3545,'[1]Combined AA and BB'!$A$1:$C$6133,3,FALSE)","v":"Y"}]
[null,null,null,null,67700,229.94433997083033,{"$f":"VLOOKUP(E3546,'[1]Combined AA and BB'!$A$1:$C$6133,3,FALSE)","v":"Y"}]
[null,null,null,null,67710,462.62579999999997,{"$f":"VLOOKUP(E3547,'[1]Combined AA and BB'!$A$1:$C$6133,3,FALSE)","v":"Y"}]
[null,null,null,null,67715,1507.2639110326018,{"$f":"VLOOKUP(E3548,'[1]Combined AA and BB'!$A$1:$C$6133,3,FALSE)","v":"Y"}]
[null,null,null,null,67800,238.16,{"$f":"VLOOKUP(E3549,'[1]Combined AA and BB'!$A$1:$C$6133,3,FALSE)","v":"Y"}]
[null,null,null,null,67801,301.86779999999999,{"$f":"VLOOKUP(E3550,'[1]Combined AA and BB'!$A$1:$C$6133,3,FALSE)","v":"Y"}]
[null,null,null,null,67805,375.10199999999998,{"$f":"VLOOKUP(E3551,'[1]Combined AA and BB'!$A$1:$C$6133,3,FALSE)","v":"Y"}]
[null,null,null,null,67808,1507.2639110326018,{"$f":"VLOOKUP(E3552,'[1]Combined AA and BB'!$A$1:$C$6133,3,FALSE)","v":"Y"}]
[null,null,null,null,67810,229.94433997083033,{"$f":"VLOOKUP(E3553,'[1]Combined AA and BB'!$A$1:$C$6133,3,FALSE)","v":"Y"}]
[null,null,null,null,67820,"Bundled","NA"]
[null,null,null,null,67825,250.6634,{"$f":"VLOOKUP(E3555,'[1]Combined AA and BB'!$A$1:$C$6133,3,FALSE)","v":"Y"}]
[null,null,null,null,67830,758.02651270772276,{"$f":"VLOOKUP(E3556,'[1]Combined AA and BB'!$A$1:$C$6133,3,FALSE)","v":"Y"}]
[null,null,null,null,67835,1507.2639110326018,{"$f":"VLOOKUP(E3557,'[1]Combined AA and BB'!$A$1:$C$6133,3,FALSE)","v":"Y"}]
[null,null,null,null,67840,528.11979999999994,{"$f":"VLOOKUP(E3558,'[1]Combined AA and BB'!$A$1:$C$6133,3,FALSE)","v":"Y"}]
[null,null,null,null,67850,407.84899999999999,{"$f":"VLOOKUP(E3559,'[1]Combined AA and BB'!$A$1:$C$6133,3,FALSE)","v":"Y"}]
[null,null,null,null,67875,758.02651270772276,{"$f":"VLOOKUP(E3560,'[1]Combined AA and BB'!$A$1:$C$6133,3,FALSE)","v":"Y"}]
[null,null,null,null,67880,1507.2639110326018,{"$f":"VLOOKUP(E3561,'[1]Combined AA and BB'!$A$1:$C$6133,3,FALSE)","v":"Y"}]
[null,null,null,null,67882,1507.2639110326018,{"$f":"VLOOKUP(E3562,'[1]Combined AA and BB'!$A$1:$C$6133,3,FALSE)","v":"Y"}]
[null,null,null,null,67900,1507.2639110326018,{"$f":"VLOOKUP(E3563,'[1]Combined AA and BB'!$A$1:$C$6133,3,FALSE)","v":"Y"}]
[null,null,null,null,67901,1507.2639110326018,{"$f":"VLOOKUP(E3564,'[1]Combined AA and BB'!$A$1:$C$6133,3,FALSE)","v":"Y"}]
[null,null,null,null,67902,2347.2990894385102,{"$f":"VLOOKUP(E3565,'[1]Combined AA and BB'!$A$1:$C$6133,3,FALSE)","v":"Y"}]
[null,null,null,null,67903,1507.2639110326018,{"$f":"VLOOKUP(E3566,'[1]Combined AA and BB'!$A$1:$C$6133,3,FALSE)","v":"Y"}]
[null,null,null,null,67904,1507.2639110326018,{"$f":"VLOOKUP(E3567,'[1]Combined AA and BB'!$A$1:$C$6133,3,FALSE)","v":"Y"}]
[null,null,null,null,67906,2347.2990894385102,{"$f":"VLOOKUP(E3568,'[1]Combined AA and BB'!$A$1:$C$6133,3,FALSE)","v":"Y"}]
[null,null,null,null,67908,1507.2639110326018,{"$f":"VLOOKUP(E3569,'[1]Combined AA and BB'!$A$1:$C$6133,3,FALSE)","v":"Y"}]
[null,null,null,null,67909,1507.2639110326018,{"$f":"VLOOKUP(E3570,'[1]Combined AA and BB'!$A$1:$C$6133,3,FALSE)","v":"Y"}]
[null,null,null,null,67911,1507.2639110326018,{"$f":"VLOOKUP(E3571,'[1]Combined AA and BB'!$A$1:$C$6133,3,FALSE)","v":"Y"}]
[null,null,null,null,67912,1507.2639110326018,{"$f":"VLOOKUP(E3572,'[1]Combined AA and BB'!$A$1:$C$6133,3,FALSE)","v":"Y"}]
[null,null,null,null,67914,1507.2639110326018,{"$f":"VLOOKUP(E3573,'[1]Combined AA and BB'!$A$1:$C$6133,3,FALSE)","v":"Y"}]
[null,null,null,null,67915,597.18619999999999,{"$f":"VLOOKUP(E3574,'[1]Combined AA and BB'!$A$1:$C$6133,3,FALSE)","v":"Y"}]
[null,null,null,null,67916,1507.2639110326018,{"$f":"VLOOKUP(E3575,'[1]Combined AA and BB'!$A$1:$C$6133,3,FALSE)","v":"Y"}]
[null,null,null,null,67917,1507.2639110326018,{"$f":"VLOOKUP(E3576,'[1]Combined AA and BB'!$A$1:$C$6133,3,FALSE)","v":"Y"}]
[null,null,null,null,67921,1507.2639110326018,{"$f":"VLOOKUP(E3577,'[1]Combined AA and BB'!$A$1:$C$6133,3,FALSE)","v":"Y"}]
[null,null,null,null,67922,579.32420000000002,{"$f":"VLOOKUP(E3578,'[1]Combined AA and BB'!$A$1:$C$6133,3,FALSE)","v":"Y"}]
[null,null,null,null,67923,1507.2639110326018,{"$f":"VLOOKUP(E3579,'[1]Combined AA and BB'!$A$1:$C$6133,3,FALSE)","v":"Y"}]
[null,null,null,null,67924,1507.2639110326018,{"$f":"VLOOKUP(E3580,'[1]Combined AA and BB'!$A$1:$C$6133,3,FALSE)","v":"Y"}]
[null,null,null,null,67930,689.47320000000002,{"$f":"VLOOKUP(E3581,'[1]Combined AA and BB'!$A$1:$C$6133,3,FALSE)","v":"Y"}]
[null,null,null,null,67935,1507.2639110326018,{"$f":"VLOOKUP(E3582,'[1]Combined AA and BB'!$A$1:$C$6133,3,FALSE)","v":"Y"}]
[null,null,null,null,67938,229.94433997083033,{"$f":"VLOOKUP(E3583,'[1]Combined AA and BB'!$A$1:$C$6133,3,FALSE)","v":"Y"}]
[null,null,null,null,67950,1507.2639110326018,{"$f":"VLOOKUP(E3584,'[1]Combined AA and BB'!$A$1:$C$6133,3,FALSE)","v":"Y"}]
[null,null,null,null,67961,1507.2639110326018,{"$f":"VLOOKUP(E3585,'[1]Combined AA and BB'!$A$1:$C$6133,3,FALSE)","v":"Y"}]
[null,null,null,null,67966,1507.2639110326018,{"$f":"VLOOKUP(E3586,'[1]Combined AA and BB'!$A$1:$C$6133,3,FALSE)","v":"Y"}]
[null,null,null,null,67971,1507.2639110326018,{"$f":"VLOOKUP(E3587,'[1]Combined AA and BB'!$A$1:$C$6133,3,FALSE)","v":"Y"}]
[null,null,null,null,67973,1507.2639110326018,{"$f":"VLOOKUP(E3588,'[1]Combined AA and BB'!$A$1:$C$6133,3,FALSE)","v":"Y"}]
[null,null,null,null,67974,2347.2990894385102,{"$f":"VLOOKUP(E3589,'[1]Combined AA and BB'!$A$1:$C$6133,3,FALSE)","v":"Y"}]
[null,null,null,null,67975,1507.2639110326018,{"$f":"VLOOKUP(E3590,'[1]Combined AA and BB'!$A$1:$C$6133,3,FALSE)","v":"Y"}]
[null,null,null,null,68020,223.87039999999999,{"$f":"VLOOKUP(E3591,'[1]Combined AA and BB'!$A$1:$C$6133,3,FALSE)","v":"Y"}]
[null,null,null,null,68040,"Not covered","NA"]
[null,null,null,null,68100,338.18719999999996,{"$f":"VLOOKUP(E3593,'[1]Combined AA and BB'!$A$1:$C$6133,3,FALSE)","v":"Y"}]
[null,null,null,null,68110,443.57299999999998,{"$f":"VLOOKUP(E3594,'[1]Combined AA and BB'!$A$1:$C$6133,3,FALSE)","v":"Y"}]
[null,null,null,null,68115,1507.2639110326018,{"$f":"VLOOKUP(E3595,'[1]Combined AA and BB'!$A$1:$C$6133,3,FALSE)","v":"Y"}]
[null,null,null,null,68130,1507.2639110326018,{"$f":"VLOOKUP(E3596,'[1]Combined AA and BB'!$A$1:$C$6133,3,FALSE)","v":"Y"}]
[null,null,null,null,68135,290.55520000000001,{"$f":"VLOOKUP(E3597,'[1]Combined AA and BB'!$A$1:$C$6133,3,FALSE)","v":"Y"}]
[null,null,null,null,68200,"Bundled","NA"]
[null,null,null,null,68320,1507.2639110326018,{"$f":"VLOOKUP(E3599,'[1]Combined AA and BB'!$A$1:$C$6133,3,FALSE)","v":"Y"}]
[null,null,null,null,68325,2347.2990894385102,{"$f":"VLOOKUP(E3600,'[1]Combined AA and BB'!$A$1:$C$6133,3,FALSE)","v":"Y"}]
[null,null,null,null,68326,2347.2990894385102,{"$f":"VLOOKUP(E3601,'[1]Combined AA and BB'!$A$1:$C$6133,3,FALSE)","v":"Y"}]
[null,null,null,null,68328,1507.2639110326018,{"$f":"VLOOKUP(E3602,'[1]Combined AA and BB'!$A$1:$C$6133,3,FALSE)","v":"Y"}]
[null,null,null,null,68330,1837.0719679675519,{"$f":"VLOOKUP(E3603,'[1]Combined AA and BB'!$A$1:$C$6133,3,FALSE)","v":"Y"}]
[null,null,null,null,68335,2347.2990894385102,{"$f":"VLOOKUP(E3604,'[1]Combined AA and BB'!$A$1:$C$6133,3,FALSE)","v":"Y"}]
[null,null,null,null,68340,1507.2639110326018,{"$f":"VLOOKUP(E3605,'[1]Combined AA and BB'!$A$1:$C$6133,3,FALSE)","v":"Y"}]
[null,null,null,null,68360,2347.2990894385102,{"$f":"VLOOKUP(E3606,'[1]Combined AA and BB'!$A$1:$C$6133,3,FALSE)","v":"Y"}]
[null,null,null,null,68362,1507.2639110326018,{"$f":"VLOOKUP(E3607,'[1]Combined AA and BB'!$A$1:$C$6133,3,FALSE)","v":"Y"}]
[null,null,null,null,68371,1507.2639110326018,{"$f":"VLOOKUP(E3608,'[1]Combined AA and BB'!$A$1:$C$6133,3,FALSE)","v":"Y"}]
[null,null,null,null,68400,562.05759999999998,{"$f":"VLOOKUP(E3609,'[1]Combined AA and BB'!$A$1:$C$6133,3,FALSE)","v":"Y"}]
[null,null,null,null,68420,625.16999999999996,{"$f":"VLOOKUP(E3610,'[1]Combined AA and BB'!$A$1:$C$6133,3,FALSE)","v":"Y"}]
[null,null,null,null,68440,193.505,{"$f":"VLOOKUP(E3611,'[1]Combined AA and BB'!$A$1:$C$6133,3,FALSE)","v":"Y"}]
[null,null,null,null,68500,2347.2990894385102,{"$f":"VLOOKUP(E3612,'[1]Combined AA and BB'!$A$1:$C$6133,3,FALSE)","v":"Y"}]
[null,null,null,null,68505,2347.2990894385102,{"$f":"VLOOKUP(E3613,'[1]Combined AA and BB'!$A$1:$C$6133,3,FALSE)","v":"Y"}]
[null,null,null,null,68510,1507.2639110326018,{"$f":"VLOOKUP(E3614,'[1]Combined AA and BB'!$A$1:$C$6133,3,FALSE)","v":"Y"}]
[null,null,null,null,68520,2347.2990894385102,{"$f":"VLOOKUP(E3615,'[1]Combined AA and BB'!$A$1:$C$6133,3,FALSE)","v":"Y"}]
[null,null,null,null,68525,1507.2639110326018,{"$f":"VLOOKUP(E3616,'[1]Combined AA and BB'!$A$1:$C$6133,3,FALSE)","v":"Y"}]
[null,null,null,null,68530,229.94433997083033,{"$f":"VLOOKUP(E3617,'[1]Combined AA and BB'!$A$1:$C$6133,3,FALSE)","v":"Y"}]
[null,null,null,null,68540,"Not covered","NA"]
[null,null,null,null,68550,"Not covered","NA"]
[null,null,null,null,68700,1507.2639110326018,{"$f":"VLOOKUP(E3620,'[1]Combined AA and BB'!$A$1:$C$6133,3,FALSE)","v":"Y"}]
[null,null,null,null,68705,229.94433997083033,{"$f":"VLOOKUP(E3621,'[1]Combined AA and BB'!$A$1:$C$6133,3,FALSE)","v":"Y"}]
[null,null,null,null,68720,2347.2990894385102,{"$f":"VLOOKUP(E3622,'[1]Combined AA and BB'!$A$1:$C$6133,3,FALSE)","v":"Y"}]
[null,null,null,null,68745,2347.2990894385102,{"$f":"VLOOKUP(E3623,'[1]Combined AA and BB'!$A$1:$C$6133,3,FALSE)","v":"Y"}]
[null,null,null,null,68750,2347.2990894385102,{"$f":"VLOOKUP(E3624,'[1]Combined AA and BB'!$A$1:$C$6133,3,FALSE)","v":"Y"}]
[null,null,null,null,68760,229.94433997083033,{"$f":"VLOOKUP(E3625,'[1]Combined AA and BB'!$A$1:$C$6133,3,FALSE)","v":"Y"}]
[null,null,null,null,68761,272.09780000000001,{"$f":"VLOOKUP(E3626,'[1]Combined AA and BB'!$A$1:$C$6133,3,FALSE)","v":"Y"}]
[null,null,null,null,68770,1507.2639110326018,{"$f":"VLOOKUP(E3627,'[1]Combined AA and BB'!$A$1:$C$6133,3,FALSE)","v":"Y"}]
[null,null,null,null,68801,"Bundled","NA"]
[null,null,null,null,68810,229.94433997083033,{"$f":"VLOOKUP(E3629,'[1]Combined AA and BB'!$A$1:$C$6133,3,FALSE)","v":"Y"}]
[null,null,null,null,68811,1507.2639110326018,{"$f":"VLOOKUP(E3630,'[1]Combined AA and BB'!$A$1:$C$6133,3,FALSE)","v":"Y"}]
[null,null,null,null,68815,1507.2639110326018,{"$f":"VLOOKUP(E3631,'[1]Combined AA and BB'!$A$1:$C$6133,3,FALSE)","v":"Y"}]
[null,null,null,null,68816,1507.2639110326018,{"$f":"VLOOKUP(E3632,'[1]Combined AA and BB'!$A$1:$C$6133,3,FALSE)","v":"Y"}]
[null,null,null,null,68840,247.68639999999999,{"$f":"VLOOKUP(E3633,'[1]Combined AA and BB'!$A$1:$C$6133,3,FALSE)","v":"Y"}]
[null,null,null,null,68850,"Bundled","NA"]
[null,null,null,null,69000,351.88139999999999,{"$f":"VLOOKUP(E3635,'[1]Combined AA and BB'!$A$1:$C$6133,3,FALSE)","v":"Y"}]
[null,null,null,null,69005,410.82600000000002,{"$f":"VLOOKUP(E3636,'[1]Combined AA and BB'!$A$1:$C$6133,3,FALSE)","v":"Y"}]
[null,null,null,null,69020,445.95460000000003,{"$f":"VLOOKUP(E3637,'[1]Combined AA and BB'!$A$1:$C$6133,3,FALSE)","v":"Y"}]
[null,null,null,null,69100,181.0016,{"$f":"VLOOKUP(E3638,'[1]Combined AA and BB'!$A$1:$C$6133,3,FALSE)","v":"Y"}]
[null,null,null,null,69105,276.26559999999995,{"$f":"VLOOKUP(E3639,'[1]Combined AA and BB'!$A$1:$C$6133,3,FALSE)","v":"Y"}]
[null,null,null,null,69110,1789.2422303467429,{"$f":"VLOOKUP(E3640,'[1]Combined AA and BB'!$A$1:$C$6133,3,FALSE)","v":"Y"}]
[null,null,null,null,69120,4253.3690655926366,{"$f":"VLOOKUP(E3641,'[1]Combined AA and BB'!$A$1:$C$6133,3,FALSE)","v":"Y"}]
[null,null,null,null,69140,4253.3690655926366,{"$f":"VLOOKUP(E3642,'[1]Combined AA and BB'!$A$1:$C$6133,3,FALSE)","v":"Y"}]
[null,null,null,null,69145,1789.2422303467429,{"$f":"VLOOKUP(E3643,'[1]Combined AA and BB'!$A$1:$C$6133,3,FALSE)","v":"Y"}]
[null,null,null,null,69150,"Not covered","NA"]
[null,null,null,null,69200,"Bundled","NA"]
[null,null,null,null,69205,1062.8859418079082,{"$f":"VLOOKUP(E3646,'[1]Combined AA and BB'!$A$1:$C$6133,3,FALSE)","v":"Y"}]
[null,null,null,null,69209,"Bundled","NA"]
[null,null,null,null,69210,"Bundled","NA"]
[null,null,null,null,69220,"Bundled","NA"]
[null,null,null,null,69222,410.82600000000002,{"$f":"VLOOKUP(E3650,'[1]Combined AA and BB'!$A$1:$C$6133,3,FALSE)","v":"Y"}]
[null,null,null,null,69300,"Not covered","NA"]
[null,null,null,null,69310,4253.3690655926366,{"$f":"VLOOKUP(E3652,'[1]Combined AA and BB'!$A$1:$C$6133,3,FALSE)","v":"Y"}]
[null,null,null,null,69320,"Not covered","NA"]
[null,null,null,null,69420,180.53152367673368,{"$f":"VLOOKUP(E3654,'[1]Combined AA and BB'!$A$1:$C$6133,3,FALSE)","v":"Y"}]
[null,null,null,null,69421,1916.5286762415849,{"$f":"VLOOKUP(E3655,'[1]Combined AA and BB'!$A$1:$C$6133,3,FALSE)","v":"Y"}]
[null,null,null,null,69424,242.92320000000001,{"$f":"VLOOKUP(E3656,'[1]Combined AA and BB'!$A$1:$C$6133,3,FALSE)","v":"N"}]
[null,null,null,null,69433,382.24680000000001,{"$f":"VLOOKUP(E3657,'[1]Combined AA and BB'!$A$1:$C$6133,3,FALSE)","v":"Y"}]
[null,null,null,null,69436,985.80817689537298,{"$f":"VLOOKUP(E3658,'[1]Combined AA and BB'!$A$1:$C$6133,3,FALSE)","v":"Y"}]
[null,null,null,null,69440,1916.5286762415849,{"$f":"VLOOKUP(E3659,'[1]Combined AA and BB'!$A$1:$C$6133,3,FALSE)","v":"Y"}]
[null,null,null,null,69450,1916.5286762415849,{"$f":"VLOOKUP(E3660,'[1]Combined AA and BB'!$A$1:$C$6133,3,FALSE)","v":"Y"}]
[null,null,null,null,69501,4253.3690655926366,{"$f":"VLOOKUP(E3661,'[1]Combined AA and BB'!$A$1:$C$6133,3,FALSE)","v":"Y"}]
[null,null,null,null,69502,4253.3690655926366,{"$f":"VLOOKUP(E3662,'[1]Combined AA and BB'!$A$1:$C$6133,3,FALSE)","v":"Y"}]
[null,null,null,null,69505,4253.3690655926366,{"$f":"VLOOKUP(E3663,'[1]Combined AA and BB'!$A$1:$C$6133,3,FALSE)","v":"Y"}]
[null,null,null,null,69511,4253.3690655926366,{"$f":"VLOOKUP(E3664,'[1]Combined AA and BB'!$A$1:$C$6133,3,FALSE)","v":"Y"}]
[null,null,null,null,69530,4253.3690655926366,{"$f":"VLOOKUP(E3665,'[1]Combined AA and BB'!$A$1:$C$6133,3,FALSE)","v":"Y"}]
[null,null,null,null,69540,"Not covered","NA"]
[null,null,null,null,69550,"Not covered","NA"]
[null,null,null,null,69552,"Not covered","NA"]
[null,null,null,null,69601,4253.3690655926366,{"$f":"VLOOKUP(E3669,'[1]Combined AA and BB'!$A$1:$C$6133,3,FALSE)","v":"Y"}]
[null,null,null,null,69602,4253.3690655926366,{"$f":"VLOOKUP(E3670,'[1]Combined AA and BB'!$A$1:$C$6133,3,FALSE)","v":"Y"}]
[null,null,null,null,69603,4253.3690655926366,{"$f":"VLOOKUP(E3671,'[1]Combined AA and BB'!$A$1:$C$6133,3,FALSE)","v":"Y"}]
[null,null,null,null,69604,4253.3690655926366,{"$f":"VLOOKUP(E3672,'[1]Combined AA and BB'!$A$1:$C$6133,3,FALSE)","v":"Y"}]
[null,null,null,null,69610,713.88459999999998,{"$f":"VLOOKUP(E3673,'[1]Combined AA and BB'!$A$1:$C$6133,3,FALSE)","v":"Y"}]
[null,null,null,null,69620,1916.5286762415849,{"$f":"VLOOKUP(E3674,'[1]Combined AA and BB'!$A$1:$C$6133,3,FALSE)","v":"Y"}]
[null,null,null,null,69631,4253.3690655926366,{"$f":"VLOOKUP(E3675,'[1]Combined AA and BB'!$A$1:$C$6133,3,FALSE)","v":"Y"}]
[null,null,null,null,69632,4253.3690655926366,{"$f":"VLOOKUP(E3676,'[1]Combined AA and BB'!$A$1:$C$6133,3,FALSE)","v":"Y"}]
[null,null,null,null,69633,4253.3690655926366,{"$f":"VLOOKUP(E3677,'[1]Combined AA and BB'!$A$1:$C$6133,3,FALSE)","v":"Y"}]
[null,null,null,null,69635,4253.3690655926366,{"$f":"VLOOKUP(E3678,'[1]Combined AA and BB'!$A$1:$C$6133,3,FALSE)","v":"Y"}]
[null,null,null,null,69636,4253.3690655926366,{"$f":"VLOOKUP(E3679,'[1]Combined AA and BB'!$A$1:$C$6133,3,FALSE)","v":"Y"}]
[null,null,null,null,69637,4253.3690655926366,{"$f":"VLOOKUP(E3680,'[1]Combined AA and BB'!$A$1:$C$6133,3,FALSE)","v":"Y"}]
[null,null,null,null,69641,4253.3690655926366,{"$f":"VLOOKUP(E3681,'[1]Combined AA and BB'!$A$1:$C$6133,3,FALSE)","v":"Y"}]
[null,null,null,null,69642,4253.3690655926366,{"$f":"VLOOKUP(E3682,'[1]Combined AA and BB'!$A$1:$C$6133,3,FALSE)","v":"Y"}]
[null,null,null,null,69643,4253.3690655926366,{"$f":"VLOOKUP(E3683,'[1]Combined AA and BB'!$A$1:$C$6133,3,FALSE)","v":"Y"}]
[null,null,null,null,69644,4253.3690655926366,{"$f":"VLOOKUP(E3684,'[1]Combined AA and BB'!$A$1:$C$6133,3,FALSE)","v":"Y"}]
[null,null,null,null,69645,4253.3690655926366,{"$f":"VLOOKUP(E3685,'[1]Combined AA and BB'!$A$1:$C$6133,3,FALSE)","v":"Y"}]
[null,null,null,null,69646,4253.3690655926366,{"$f":"VLOOKUP(E3686,'[1]Combined AA and BB'!$A$1:$C$6133,3,FALSE)","v":"Y"}]
[null,null,null,null,69650,1916.5286762415849,{"$f":"VLOOKUP(E3687,'[1]Combined AA and BB'!$A$1:$C$6133,3,FALSE)","v":"Y"}]
[null,null,null,null,69660,4253.3690655926366,{"$f":"VLOOKUP(E3688,'[1]Combined AA and BB'!$A$1:$C$6133,3,FALSE)","v":"Y"}]
[null,null,null,null,69661,4253.3690655926366,{"$f":"VLOOKUP(E3689,'[1]Combined AA and BB'!$A$1:$C$6133,3,FALSE)","v":"Y"}]
[null,null,null,null,69662,4253.3690655926366,{"$f":"VLOOKUP(E3690,'[1]Combined AA and BB'!$A$1:$C$6133,3,FALSE)","v":"Y"}]
[null,null,null,null,69666,1916.5286762415849,{"$f":"VLOOKUP(E3691,'[1]Combined AA and BB'!$A$1:$C$6133,3,FALSE)","v":"Y"}]
[null,null,null,null,69667,1916.5286762415849,{"$f":"VLOOKUP(E3692,'[1]Combined AA and BB'!$A$1:$C$6133,3,FALSE)","v":"Y"}]
[null,null,null,null,69670,4253.3690655926366,{"$f":"VLOOKUP(E3693,'[1]Combined AA and BB'!$A$1:$C$6133,3,FALSE)","v":"Y"}]
[null,null,null,null,69676,1916.5286762415849,{"$f":"VLOOKUP(E3694,'[1]Combined AA and BB'!$A$1:$C$6133,3,FALSE)","v":"Y"}]
[null,null,null,null,69700,985.80817689537298,{"$f":"VLOOKUP(E3695,'[1]Combined AA and BB'!$A$1:$C$6133,3,FALSE)","v":"Y"}]
[null,null,null,null,69705,8072.9841360078899,{"$f":"VLOOKUP(E3696,'[1]Combined AA and BB'!$A$1:$C$6133,3,FALSE)","v":"Y"}]
[null,null,null,null,69706,7980.2622574300776,{"$f":"VLOOKUP(E3697,'[1]Combined AA and BB'!$A$1:$C$6133,3,FALSE)","v":"Y"}]
[null,null,null,null,69711,1916.5286762415849,{"$f":"VLOOKUP(E3698,'[1]Combined AA and BB'!$A$1:$C$6133,3,FALSE)","v":"Y"}]
[null,null,null,null,69714,22311.722782349592,{"$f":"VLOOKUP(E3699,'[1]Combined AA and BB'!$A$1:$C$6133,3,FALSE)","v":"Y"}]
[null,null,null,null,69716,18155.003014557024,{"$f":"VLOOKUP(E3700,'[1]Combined AA and BB'!$A$1:$C$6133,3,FALSE)","v":"Y"}]
[null,null,null,null,69717,11089.848558519257,{"$f":"VLOOKUP(E3701,'[1]Combined AA and BB'!$A$1:$C$6133,3,FALSE)","v":"Y"}]
[null,null,null,null,69719,18155.003014557024,{"$f":"VLOOKUP(E3702,'[1]Combined AA and BB'!$A$1:$C$6133,3,FALSE)","v":"Y"}]
[null,null,null,null,69720,4253.3690655926366,{"$f":"VLOOKUP(E3703,'[1]Combined AA and BB'!$A$1:$C$6133,3,FALSE)","v":"Y"}]
[null,null,null,null,69726,2360.4308567939793,{"$f":"VLOOKUP(E3704,'[1]Combined AA and BB'!$A$1:$C$6133,3,FALSE)","v":"Y"}]
[null,null,null,null,69727,2360.4308567939793,{"$f":"VLOOKUP(E3705,'[1]Combined AA and BB'!$A$1:$C$6133,3,FALSE)","v":"Y"}]
[null,null,null,null,69728,"Not covered","NA"]
[null,null,null,null,69729,"Not covered","NA"]
[null,null,null,null,69730,"Not covered","NA"]
[null,null,null,null,69740,4253.3690655926366,{"$f":"VLOOKUP(E3709,'[1]Combined AA and BB'!$A$1:$C$6133,3,FALSE)","v":"Y"}]
[null,null,null,null,69745,4253.3690655926366,{"$f":"VLOOKUP(E3710,'[1]Combined AA and BB'!$A$1:$C$6133,3,FALSE)","v":"Y"}]
[null,null,null,null,69801,429.28339999999997,{"$f":"VLOOKUP(E3711,'[1]Combined AA and BB'!$A$1:$C$6133,3,FALSE)","v":"Y"}]
[null,null,null,null,69805,4253.3690655926366,{"$f":"VLOOKUP(E3712,'[1]Combined AA and BB'!$A$1:$C$6133,3,FALSE)","v":"Y"}]
[null,null,null,null,69806,4253.3690655926366,{"$f":"VLOOKUP(E3713,'[1]Combined AA and BB'!$A$1:$C$6133,3,FALSE)","v":"Y"}]
[null,null,null,null,69905,4253.3690655926366,{"$f":"VLOOKUP(E3714,'[1]Combined AA and BB'!$A$1:$C$6133,3,FALSE)","v":"Y"}]
[null,null,null,null,69910,4253.3690655926366,{"$f":"VLOOKUP(E3715,'[1]Combined AA and BB'!$A$1:$C$6133,3,FALSE)","v":"Y"}]
[null,null,null,null,69915,1916.5286762415849,{"$f":"VLOOKUP(E3716,'[1]Combined AA and BB'!$A$1:$C$6133,3,FALSE)","v":"Y"}]
[null,null,null,null,69930,66111.439288747875,{"$f":"VLOOKUP(E3717,'[1]Combined AA and BB'!$A$1:$C$6133,3,FALSE)","v":"Y"}]
[null,null,null,null,69990,"Bundled","NA"]
[null,null,null,null,70010,"Bundled","NA"]
[null,null,null,null,70015,"Not covered","NA"]
[null,null,null,null,70030,"Bundled","NA"]
[null,null,null,null,70100,"Bundled","NA"]
[null,null,null,null,70110,"Bundled","NA"]
[null,null,null,null,70120,"Bundled","NA"]
[null,null,null,null,70130,"Bundled","NA"]
[null,null,null,null,70134,"Bundled","NA"]
[null,null,null,null,70140,"Bundled","NA"]
[null,null,null,null,70150,"Bundled","NA"]
[null,null,null,null,70160,"Bundled","NA"]
[null,null,null,null,70170,"Bundled","NA"]
[null,null,null,null,70190,"Bundled","NA"]
[null,null,null,null,70200,"Bundled","NA"]
[null,null,null,null,70210,"Bundled","NA"]
[null,null,null,null,70220,"Bundled","NA"]
[null,null,null,null,70240,"Bundled","NA"]
[null,null,null,null,70250,"Bundled","NA"]
[null,null,null,null,70260,"Bundled","NA"]
[null,null,null,null,70300,"Bundled","NA"]
[null,null,null,null,70310,"Bundled","NA"]
[null,null,null,null,70320,"Bundled","NA"]
[null,null,null,null,70328,"Bundled","NA"]
[null,null,null,null,70330,"Bundled","NA"]
[null,null,null,null,70332,"Bundled","NA"]
[null,null,null,null,70336,202.85033775915127,{"$f":"VLOOKUP(E3744,'[1]Combined AA and BB'!$A$1:$C$6133,3,FALSE)","v":"N"}]
[null,null,null,null,70350,"Bundled","NA"]
[null,null,null,null,70355,"Bundled","NA"]
[null,null,null,null,70360,"Bundled","NA"]
[null,null,null,null,70370,"Bundled","NA"]
[null,null,null,null,70371,"Bundled","NA"]
[null,null,null,null,70380,"Bundled","NA"]
[null,null,null,null,70390,"Bundled","NA"]
[null,null,null,null,70450,92.83934602035103,{"$f":"VLOOKUP(E3752,'[1]Combined AA and BB'!$A$1:$C$6133,3,FALSE)","v":"N"}]
[null,null,null,null,70460,156.64693232729377,{"$f":"VLOOKUP(E3753,'[1]Combined AA and BB'!$A$1:$C$6133,3,FALSE)","v":"N"}]
[null,null,null,null,70470,156.64693232729377,{"$f":"VLOOKUP(E3754,'[1]Combined AA and BB'!$A$1:$C$6133,3,FALSE)","v":"N"}]
[null,null,null,null,70480,92.83934602035103,{"$f":"VLOOKUP(E3755,'[1]Combined AA and BB'!$A$1:$C$6133,3,FALSE)","v":"N"}]
[null,null,null,null,70481,156.64693232729377,{"$f":"VLOOKUP(E3756,'[1]Combined AA and BB'!$A$1:$C$6133,3,FALSE)","v":"N"}]
[null,null,null,null,70482,156.64693232729377,{"$f":"VLOOKUP(E3757,'[1]Combined AA and BB'!$A$1:$C$6133,3,FALSE)","v":"N"}]
[null,null,null,null,70486,92.83934602035103,{"$f":"VLOOKUP(E3758,'[1]Combined AA and BB'!$A$1:$C$6133,3,FALSE)","v":"N"}]
[null,null,null,null,70487,156.64693232729377,{"$f":"VLOOKUP(E3759,'[1]Combined AA and BB'!$A$1:$C$6133,3,FALSE)","v":"N"}]
[null,null,null,null,70488,156.64693232729377,{"$f":"VLOOKUP(E3760,'[1]Combined AA and BB'!$A$1:$C$6133,3,FALSE)","v":"N"}]
[null,null,null,null,70490,92.83934602035103,{"$f":"VLOOKUP(E3761,'[1]Combined AA and BB'!$A$1:$C$6133,3,FALSE)","v":"N"}]
[null,null,null,null,70491,156.64693232729377,{"$f":"VLOOKUP(E3762,'[1]Combined AA and BB'!$A$1:$C$6133,3,FALSE)","v":"N"}]
[null,null,null,null,70492,156.64693232729377,{"$f":"VLOOKUP(E3763,'[1]Combined AA and BB'!$A$1:$C$6133,3,FALSE)","v":"N"}]
[null,null,null,null,70496,156.64693232729377,{"$f":"VLOOKUP(E3764,'[1]Combined AA and BB'!$A$1:$C$6133,3,FALSE)","v":"N"}]
[null,null,null,null,70498,156.64693232729377,{"$f":"VLOOKUP(E3765,'[1]Combined AA and BB'!$A$1:$C$6133,3,FALSE)","v":"N"}]
[null,null,null,null,70540,202.85033775915127,{"$f":"VLOOKUP(E3766,'[1]Combined AA and BB'!$A$1:$C$6133,3,FALSE)","v":"N"}]
[null,null,null,null,70542,320.03276239497637,{"$f":"VLOOKUP(E3767,'[1]Combined AA and BB'!$A$1:$C$6133,3,FALSE)","v":"N"}]
[null,null,null,null,70543,320.03276239497637,{"$f":"VLOOKUP(E3768,'[1]Combined AA and BB'!$A$1:$C$6133,3,FALSE)","v":"N"}]
[null,null,null,null,70544,202.85033775915127,{"$f":"VLOOKUP(E3769,'[1]Combined AA and BB'!$A$1:$C$6133,3,FALSE)","v":"N"}]
[null,null,null,null,70545,449.52699999999999,{"$f":"VLOOKUP(E3770,'[1]Combined AA and BB'!$A$1:$C$6133,3,FALSE)","v":"N"}]
[null,null,null,null,70546,320.03276239497637,{"$f":"VLOOKUP(E3771,'[1]Combined AA and BB'!$A$1:$C$6133,3,FALSE)","v":"N"}]
[null,null,null,null,70547,202.85033775915127,{"$f":"VLOOKUP(E3772,'[1]Combined AA and BB'!$A$1:$C$6133,3,FALSE)","v":"N"}]
[null,null,null,null,70548,485.25100000000003,{"$f":"VLOOKUP(E3773,'[1]Combined AA and BB'!$A$1:$C$6133,3,FALSE)","v":"N"}]
[null,null,null,null,70549,320.03276239497637,{"$f":"VLOOKUP(E3774,'[1]Combined AA and BB'!$A$1:$C$6133,3,FALSE)","v":"N"}]
[null,null,null,null,70551,202.85033775915127,{"$f":"VLOOKUP(E3775,'[1]Combined AA and BB'!$A$1:$C$6133,3,FALSE)","v":"N"}]
[null,null,null,null,70552,320.03276239497637,{"$f":"VLOOKUP(E3776,'[1]Combined AA and BB'!$A$1:$C$6133,3,FALSE)","v":"N"}]
[null,null,null,null,70553,320.03276239497637,{"$f":"VLOOKUP(E3777,'[1]Combined AA and BB'!$A$1:$C$6133,3,FALSE)","v":"N"}]
[null,null,null,null,70554,"Not covered","NA"]
[null,null,null,null,70555,"Not covered","NA"]
[null,null,null,null,70557,"Not covered","NA"]
[null,null,null,null,70558,"Not covered","NA"]
[null,null,null,null,70559,"Not covered","NA"]
[null,null,null,null,71045,48.822799999999994,{"$f":"VLOOKUP(E3783,'[1]Combined AA and BB'!$A$1:$C$6133,3,FALSE)","v":"N"}]
[null,null,null,null,71046,63.707800000000006,{"$f":"VLOOKUP(E3784,'[1]Combined AA and BB'!$A$1:$C$6133,3,FALSE)","v":"N"}]
[null,null,null,null,71047,"Bundled","NA"]
[null,null,null,null,71048,"Bundled","NA"]
[null,null,null,null,71100,"Bundled","NA"]
[null,null,null,null,71101,"Bundled","NA"]
[null,null,null,null,71110,"Bundled","NA"]
[null,null,null,null,71111,"Bundled","NA"]
[null,null,null,null,71120,"Bundled","NA"]
[null,null,null,null,71130,"Bundled","NA"]
[null,null,null,null,71250,92.83934602035103,{"$f":"VLOOKUP(E3793,'[1]Combined AA and BB'!$A$1:$C$6133,3,FALSE)","v":"N"}]
[null,null,null,null,71260,156.64693232729377,{"$f":"VLOOKUP(E3794,'[1]Combined AA and BB'!$A$1:$C$6133,3,FALSE)","v":"N"}]
[null,null,null,null,71270,156.64693232729377,{"$f":"VLOOKUP(E3795,'[1]Combined AA and BB'!$A$1:$C$6133,3,FALSE)","v":"N"}]
[null,null,null,null,71275,156.64693232729377,{"$f":"VLOOKUP(E3796,'[1]Combined AA and BB'!$A$1:$C$6133,3,FALSE)","v":"N"}]
[null,null,null,null,71550,202.85033775915127,{"$f":"VLOOKUP(E3797,'[1]Combined AA and BB'!$A$1:$C$6133,3,FALSE)","v":"N"}]
[null,null,null,null,71551,744.84539999999993,{"$f":"VLOOKUP(E3798,'[1]Combined AA and BB'!$A$1:$C$6133,3,FALSE)","v":"N"}]
[null,null,null,null,71552,320.03276239497637,{"$f":"VLOOKUP(E3799,'[1]Combined AA and BB'!$A$1:$C$6133,3,FALSE)","v":"N"}]
[null,null,null,null,72020,"Bundled","NA"]
[null,null,null,null,72040,"Bundled","NA"]
[null,null,null,null,72050,"Bundled","NA"]
[null,null,null,null,72052,"Bundled","NA"]
[null,null,null,null,72070,"Bundled","NA"]
[null,null,null,null,72072,"Bundled","NA"]
[null,null,null,null,72074,"Bundled","NA"]
[null,null,null,null,72080,"Bundled","NA"]
[null,null,null,null,72083,92.83934602035103,{"$f":"VLOOKUP(E3808,'[1]Combined AA and BB'!$A$1:$C$6133,3,FALSE)","v":"N"}]
[null,null,null,null,72084,92.83934602035103,{"$f":"VLOOKUP(E3809,'[1]Combined AA and BB'!$A$1:$C$6133,3,FALSE)","v":"N"}]
[null,null,null,null,72100,"Bundled","NA"]
[null,null,null,null,72110,"Bundled","NA"]
[null,null,null,null,72114,"Bundled","NA"]
[null,null,null,null,72120,"Bundled","NA"]
[null,null,null,null,72125,92.83934602035103,{"$f":"VLOOKUP(E3814,'[1]Combined AA and BB'!$A$1:$C$6133,3,FALSE)","v":"N"}]
[null,null,null,null,72126,330.447,{"$f":"VLOOKUP(E3815,'[1]Combined AA and BB'!$A$1:$C$6133,3,FALSE)","v":"N"}]
[null,null,null,null,72127,156.64693232729377,{"$f":"VLOOKUP(E3816,'[1]Combined AA and BB'!$A$1:$C$6133,3,FALSE)","v":"N"}]
[null,null,null,null,72128,92.83934602035103,{"$f":"VLOOKUP(E3817,'[1]Combined AA and BB'!$A$1:$C$6133,3,FALSE)","v":"N"}]
[null,null,null,null,72129,156.64693232729377,{"$f":"VLOOKUP(E3818,'[1]Combined AA and BB'!$A$1:$C$6133,3,FALSE)","v":"N"}]
[null,null,null,null,72130,156.64693232729377,{"$f":"VLOOKUP(E3819,'[1]Combined AA and BB'!$A$1:$C$6133,3,FALSE)","v":"N"}]
[null,null,null,null,72131,92.83934602035103,{"$f":"VLOOKUP(E3820,'[1]Combined AA and BB'!$A$1:$C$6133,3,FALSE)","v":"N"}]
[null,null,null,null,72132,331.04239999999999,{"$f":"VLOOKUP(E3821,'[1]Combined AA and BB'!$A$1:$C$6133,3,FALSE)","v":"N"}]
[null,null,null,null,72133,156.64693232729377,{"$f":"VLOOKUP(E3822,'[1]Combined AA and BB'!$A$1:$C$6133,3,FALSE)","v":"N"}]
[null,null,null,null,72141,202.85033775915127,{"$f":"VLOOKUP(E3823,'[1]Combined AA and BB'!$A$1:$C$6133,3,FALSE)","v":"N"}]
[null,null,null,null,72142,320.03276239497637,{"$f":"VLOOKUP(E3824,'[1]Combined AA and BB'!$A$1:$C$6133,3,FALSE)","v":"N"}]
[null,null,null,null,72146,202.85033775915127,{"$f":"VLOOKUP(E3825,'[1]Combined AA and BB'!$A$1:$C$6133,3,FALSE)","v":"N"}]
[null,null,null,null,72147,320.03276239497637,{"$f":"VLOOKUP(E3826,'[1]Combined AA and BB'!$A$1:$C$6133,3,FALSE)","v":"N"}]
[null,null,null,null,72148,202.85033775915127,{"$f":"VLOOKUP(E3827,'[1]Combined AA and BB'!$A$1:$C$6133,3,FALSE)","v":"N"}]
[null,null,null,null,72149,320.03276239497637,{"$f":"VLOOKUP(E3828,'[1]Combined AA and BB'!$A$1:$C$6133,3,FALSE)","v":"N"}]
[null,null,null,null,72156,320.03276239497637,{"$f":"VLOOKUP(E3829,'[1]Combined AA and BB'!$A$1:$C$6133,3,FALSE)","v":"N"}]
[null,null,null,null,72157,320.03276239497637,{"$f":"VLOOKUP(E3830,'[1]Combined AA and BB'!$A$1:$C$6133,3,FALSE)","v":"N"}]
[null,null,null,null,72158,320.03276239497637,{"$f":"VLOOKUP(E3831,'[1]Combined AA and BB'!$A$1:$C$6133,3,FALSE)","v":"N"}]
[null,null,null,null,72170,"Bundled","NA"]
[null,null,null,null,72190,"Bundled","NA"]
[null,null,null,null,72191,156.64693232729377,{"$f":"VLOOKUP(E3834,'[1]Combined AA and BB'!$A$1:$C$6133,3,FALSE)","v":"N"}]
[null,null,null,null,72192,92.83934602035103,{"$f":"VLOOKUP(E3835,'[1]Combined AA and BB'!$A$1:$C$6133,3,FALSE)","v":"N"}]
[null,null,null,null,72193,156.64693232729377,{"$f":"VLOOKUP(E3836,'[1]Combined AA and BB'!$A$1:$C$6133,3,FALSE)","v":"N"}]
[null,null,null,null,72194,156.64693232729377,{"$f":"VLOOKUP(E3837,'[1]Combined AA and BB'!$A$1:$C$6133,3,FALSE)","v":"N"}]
[null,null,null,null,72195,202.85033775915127,{"$f":"VLOOKUP(E3838,'[1]Combined AA and BB'!$A$1:$C$6133,3,FALSE)","v":"N"}]
[null,null,null,null,72196,320.03276239497637,{"$f":"VLOOKUP(E3839,'[1]Combined AA and BB'!$A$1:$C$6133,3,FALSE)","v":"N"}]
[null,null,null,null,72197,320.03276239497637,{"$f":"VLOOKUP(E3840,'[1]Combined AA and BB'!$A$1:$C$6133,3,FALSE)","v":"N"}]
[null,null,null,null,72200,"Bundled","NA"]
[null,null,null,null,72202,"Bundled","NA"]
[null,null,null,null,72220,"Bundled","NA"]
[null,null,null,null,72240,"Bundled","NA"]
[null,null,null,null,72255,"Bundled","NA"]
[null,null,null,null,72265,"Bundled","NA"]
[null,null,null,null,72270,"Bundled","NA"]
[null,null,null,null,72285,"Bundled","NA"]
[null,null,null,null,72295,"Bundled","NA"]
[null,null,null,null,73000,"Bundled","NA"]
[null,null,null,null,73010,"Bundled","NA"]
[null,null,null,null,73020,"Bundled","NA"]
[null,null,null,null,73030,"Bundled","NA"]
[null,null,null,null,73040,"Bundled","NA"]
[null,null,null,null,73050,"Bundled","NA"]
[null,null,null,null,73060,"Bundled","NA"]
[null,null,null,null,73070,"Bundled","NA"]
[null,null,null,null,73080,"Bundled","NA"]
[null,null,null,null,73085,"Bundled","NA"]
[null,null,null,null,73090,"Bundled","NA"]
[null,null,null,null,73092,"Not covered","NA"]
[null,null,null,null,73100,"Bundled","NA"]
[null,null,null,null,73110,"Bundled","NA"]
[null,null,null,null,73115,"Bundled","NA"]
[null,null,null,null,73120,"Bundled","NA"]
[null,null,null,null,73130,"Bundled","NA"]
[null,null,null,null,73140,"Bundled","NA"]
[null,null,null,null,73200,92.83934602035103,{"$f":"VLOOKUP(E3868,'[1]Combined AA and BB'!$A$1:$C$6133,3,FALSE)","v":"N"}]
[null,null,null,null,73201,397.1318,{"$f":"VLOOKUP(E3869,'[1]Combined AA and BB'!$A$1:$C$6133,3,FALSE)","v":"N"}]
[null,null,null,null,73202,156.64693232729377,{"$f":"VLOOKUP(E3870,'[1]Combined AA and BB'!$A$1:$C$6133,3,FALSE)","v":"N"}]
[null,null,null,null,73206,156.64693232729377,{"$f":"VLOOKUP(E3871,'[1]Combined AA and BB'!$A$1:$C$6133,3,FALSE)","v":"N"}]
[null,null,null,null,73218,202.85033775915127,{"$f":"VLOOKUP(E3872,'[1]Combined AA and BB'!$A$1:$C$6133,3,FALSE)","v":"N"}]
[null,null,null,null,73219,320.03276239497637,{"$f":"VLOOKUP(E3873,'[1]Combined AA and BB'!$A$1:$C$6133,3,FALSE)","v":"N"}]
[null,null,null,null,73220,320.03276239497637,{"$f":"VLOOKUP(E3874,'[1]Combined AA and BB'!$A$1:$C$6133,3,FALSE)","v":"N"}]
[null,null,null,null,73221,202.85033775915127,{"$f":"VLOOKUP(E3875,'[1]Combined AA and BB'!$A$1:$C$6133,3,FALSE)","v":"N"}]
[null,null,null,null,73222,622.78840000000002,{"$f":"VLOOKUP(E3876,'[1]Combined AA and BB'!$A$1:$C$6133,3,FALSE)","v":"N"}]
[null,null,null,null,73223,320.03276239497637,{"$f":"VLOOKUP(E3877,'[1]Combined AA and BB'!$A$1:$C$6133,3,FALSE)","v":"N"}]
[null,null,null,null,73525,"Bundled","NA"]
[null,null,null,null,73560,"Bundled","NA"]
[null,null,null,null,73562,"Bundled","NA"]
[null,null,null,null,73564,"Bundled","NA"]
[null,null,null,null,73565,"Bundled","NA"]
[null,null,null,null,73580,"Bundled","NA"]
[null,null,null,null,73590,"Bundled","NA"]
[null,null,null,null,73592,"Not covered","NA"]
[null,null,null,null,73600,"Bundled","NA"]
[null,null,null,null,73610,"Bundled","NA"]
[null,null,null,null,73615,"Bundled","NA"]
[null,null,null,null,73620,"Bundled","NA"]
[null,null,null,null,73630,"Bundled","NA"]
[null,null,null,null,73650,"Bundled","NA"]
[null,null,null,null,73660,"Bundled","NA"]
[null,null,null,null,73700,92.83934602035103,{"$f":"VLOOKUP(E3893,'[1]Combined AA and BB'!$A$1:$C$6133,3,FALSE)","v":"N"}]
[null,null,null,null,73701,156.64693232729377,{"$f":"VLOOKUP(E3894,'[1]Combined AA and BB'!$A$1:$C$6133,3,FALSE)","v":"N"}]
[null,null,null,null,73702,156.64693232729377,{"$f":"VLOOKUP(E3895,'[1]Combined AA and BB'!$A$1:$C$6133,3,FALSE)","v":"N"}]
[null,null,null,null,73706,156.64693232729377,{"$f":"VLOOKUP(E3896,'[1]Combined AA and BB'!$A$1:$C$6133,3,FALSE)","v":"N"}]
[null,null,null,null,73718,202.85033775915127,{"$f":"VLOOKUP(E3897,'[1]Combined AA and BB'!$A$1:$C$6133,3,FALSE)","v":"N"}]
[null,null,null,null,73719,320.03276239497637,{"$f":"VLOOKUP(E3898,'[1]Combined AA and BB'!$A$1:$C$6133,3,FALSE)","v":"N"}]
[null,null,null,null,73720,320.03276239497637,{"$f":"VLOOKUP(E3899,'[1]Combined AA and BB'!$A$1:$C$6133,3,FALSE)","v":"N"}]
[null,null,null,null,73721,202.85033775915127,{"$f":"VLOOKUP(E3900,'[1]Combined AA and BB'!$A$1:$C$6133,3,FALSE)","v":"N"}]
[null,null,null,null,73722,623.38380000000006,{"$f":"VLOOKUP(E3901,'[1]Combined AA and BB'!$A$1:$C$6133,3,FALSE)","v":"N"}]
[null,null,null,null,73723,320.03276239497637,{"$f":"VLOOKUP(E3902,'[1]Combined AA and BB'!$A$1:$C$6133,3,FALSE)","v":"N"}]
[null,null,null,null,74018,"Bundled","NA"]
[null,null,null,null,74019,"Bundled","NA"]
[null,null,null,null,74021,"Bundled","NA"]
[null,null,null,null,74022,"Bundled","NA"]
[null,null,null,null,74150,92.83934602035103,{"$f":"VLOOKUP(E3907,'[1]Combined AA and BB'!$A$1:$C$6133,3,FALSE)","v":"N"}]
[null,null,null,null,74160,156.64693232729377,{"$f":"VLOOKUP(E3908,'[1]Combined AA and BB'!$A$1:$C$6133,3,FALSE)","v":"N"}]
[null,null,null,null,74170,156.64693232729377,{"$f":"VLOOKUP(E3909,'[1]Combined AA and BB'!$A$1:$C$6133,3,FALSE)","v":"N"}]
[null,null,null,null,74174,320.03276239497637,{"$f":"VLOOKUP(E3910,'[1]Combined AA and BB'!$A$1:$C$6133,3,FALSE)","v":"N"}]
[null,null,null,null,74175,156.64693232729377,{"$f":"VLOOKUP(E3911,'[1]Combined AA and BB'!$A$1:$C$6133,3,FALSE)","v":"N"}]
[null,null,null,null,74176,355.4538,{"$f":"VLOOKUP(E3912,'[1]Combined AA and BB'!$A$1:$C$6133,3,FALSE)","v":"N"}]
[null,null,null,null,74177,320.03276239497637,{"$f":"VLOOKUP(E3913,'[1]Combined AA and BB'!$A$1:$C$6133,3,FALSE)","v":"N"}]
[null,null,null,null,74178,320.03276239497637,{"$f":"VLOOKUP(E3914,'[1]Combined AA and BB'!$A$1:$C$6133,3,FALSE)","v":"N"}]
[null,null,null,null,74181,202.85033775915127,{"$f":"VLOOKUP(E3915,'[1]Combined AA and BB'!$A$1:$C$6133,3,FALSE)","v":"N"}]
[null,null,null,null,74182,320.03276239497637,{"$f":"VLOOKUP(E3916,'[1]Combined AA and BB'!$A$1:$C$6133,3,FALSE)","v":"N"}]
[null,null,null,null,74183,320.03276239497637,{"$f":"VLOOKUP(E3917,'[1]Combined AA and BB'!$A$1:$C$6133,3,FALSE)","v":"N"}]
[null,null,null,null,74190,"Bundled","NA"]
[null,null,null,null,74210,"Bundled","NA"]
[null,null,null,null,74220,"Bundled","NA"]
[null,null,null,null,74230,156.64693232729377,{"$f":"VLOOKUP(E3921,'[1]Combined AA and BB'!$A$1:$C$6133,3,FALSE)","v":"N"}]
[null,null,null,null,74235,"Bundled","NA"]
[null,null,null,null,74240,236.37380000000002,{"$f":"VLOOKUP(E3923,'[1]Combined AA and BB'!$A$1:$C$6133,3,FALSE)","v":"N"}]
[null,null,null,null,74246,156.64693232729377,{"$f":"VLOOKUP(E3924,'[1]Combined AA and BB'!$A$1:$C$6133,3,FALSE)","v":"N"}]
[null,null,null,null,74250,234.58759999999998,{"$f":"VLOOKUP(E3925,'[1]Combined AA and BB'!$A$1:$C$6133,3,FALSE)","v":"N"}]
[null,null,null,null,74251,156.64693232729377,{"$f":"VLOOKUP(E3926,'[1]Combined AA and BB'!$A$1:$C$6133,3,FALSE)","v":"N"}]
[null,null,null,null,74261,92.83934602035103,{"$f":"VLOOKUP(E3927,'[1]Combined AA and BB'!$A$1:$C$6133,3,FALSE)","v":"N"}]
[null,null,null,null,74262,156.64693232729377,{"$f":"VLOOKUP(E3928,'[1]Combined AA and BB'!$A$1:$C$6133,3,FALSE)","v":"N"}]
[null,null,null,null,74270,"Bundled","NA"]
[null,null,null,null,74280,"Bundled","NA"]
[null,null,null,null,74283,156.64693232729377,{"$f":"VLOOKUP(E3931,'[1]Combined AA and BB'!$A$1:$C$6133,3,FALSE)","v":"N"}]
[null,null,null,null,74290,"Bundled","NA"]
[null,null,null,null,74300,"Bundled","NA"]
[null,null,null,null,74301,"Bundled","NA"]
[null,null,null,null,74328,"Bundled","NA"]
[null,null,null,null,74329,"Bundled","NA"]
[null,null,null,null,74330,"Bundled","NA"]
[null,null,null,null,74340,"Bundled","NA"]
[null,null,null,null,74355,"Bundled","NA"]
[null,null,null,null,74360,"Bundled","NA"]
[null,null,null,null,74363,"Bundled","NA"]
[null,null,null,null,74400,156.64693232729377,{"$f":"VLOOKUP(E3942,'[1]Combined AA and BB'!$A$1:$C$6133,3,FALSE)","v":"N"}]
[null,null,null,null,74410,156.64693232729377,{"$f":"VLOOKUP(E3943,'[1]Combined AA and BB'!$A$1:$C$6133,3,FALSE)","v":"N"}]
[null,null,null,null,74415,156.64693232729377,{"$f":"VLOOKUP(E3944,'[1]Combined AA and BB'!$A$1:$C$6133,3,FALSE)","v":"N"}]
[null,null,null,null,74420,320.03276239497637,{"$f":"VLOOKUP(E3945,'[1]Combined AA and BB'!$A$1:$C$6133,3,FALSE)","v":"N"}]
[null,null,null,null,74425,"Bundled","NA"]
[null,null,null,null,74430,"Bundled","NA"]
[null,null,null,null,74440,"Bundled","NA"]
[null,null,null,null,74445,"Bundled","NA"]
[null,null,null,null,74450,"Bundled","NA"]
[null,null,null,null,74455,"Bundled","NA"]
[null,null,null,null,74470,"Not covered","NA"]
[null,null,null,null,74485,"Bundled","NA"]
[null,null,null,null,74710,"Not covered","NA"]
[null,null,null,null,74712,"Not covered","NA"]
[null,null,null,null,74740,"Not covered","NA"]
[null,null,null,null,74742,"Not covered","NA"]
[null,null,null,null,74775,202.85033775915127,{"$f":"VLOOKUP(E3958,'[1]Combined AA and BB'!$A$1:$C$6133,3,FALSE)","v":"N"}]
[null,null,null,null,75557,202.85033775915127,{"$f":"VLOOKUP(E3959,'[1]Combined AA and BB'!$A$1:$C$6133,3,FALSE)","v":"N"}]
[null,null,null,null,75559,734.12819999999999,{"$f":"VLOOKUP(E3960,'[1]Combined AA and BB'!$A$1:$C$6133,3,FALSE)","v":"N"}]
[null,null,null,null,75561,320.03276239497637,{"$f":"VLOOKUP(E3961,'[1]Combined AA and BB'!$A$1:$C$6133,3,FALSE)","v":"N"}]
[null,null,null,null,75563,835.34619999999995,{"$f":"VLOOKUP(E3962,'[1]Combined AA and BB'!$A$1:$C$6133,3,FALSE)","v":"N"}]
[null,null,null,null,75565,"Bundled","NA"]
[null,null,null,null,75571,"Bundled","NA"]
[null,null,null,null,75572,156.64693232729377,{"$f":"VLOOKUP(E3965,'[1]Combined AA and BB'!$A$1:$C$6133,3,FALSE)","v":"N"}]
[null,null,null,null,75574,156.64693232729377,{"$f":"VLOOKUP(E3966,'[1]Combined AA and BB'!$A$1:$C$6133,3,FALSE)","v":"N"}]
[null,null,null,null,75600,"Bundled","NA"]
[null,null,null,null,75605,"Bundled","NA"]
[null,null,null,null,75625,"Bundled","NA"]
[null,null,null,null,75630,"Bundled","NA"]
[null,null,null,null,75635,"Bundled","NA"]
[null,null,null,null,75705,"Bundled","NA"]
[null,null,null,null,75710,"Bundled","NA"]
[null,null,null,null,75716,"Bundled","NA"]
[null,null,null,null,75726,"Bundled","NA"]
[null,null,null,null,75731,288.17359999999996,{"$f":"VLOOKUP(E3976,'[1]Combined AA and BB'!$A$1:$C$6133,3,FALSE)","v":"N"}]
[null,null,null,null,75733,"Bundled","NA"]
[null,null,null,null,75736,"Bundled","NA"]
[null,null,null,null,75741,"Bundled","NA"]
[null,null,null,null,75743,"Bundled","NA"]
[null,null,null,null,75746,253.04499999999999,{"$f":"VLOOKUP(E3981,'[1]Combined AA and BB'!$A$1:$C$6133,3,FALSE)","v":"N"}]
[null,null,null,null,75756,"Bundled","NA"]
[null,null,null,null,75774,"Bundled","NA"]
[null,null,null,null,75801,"Bundled","NA"]
[null,null,null,null,75803,972.78886868062955,{"$f":"VLOOKUP(E3985,'[1]Combined AA and BB'!$A$1:$C$6133,3,FALSE)","v":"N"}]
[null,null,null,null,75805,2408.9180478528747,{"$f":"VLOOKUP(E3986,'[1]Combined AA and BB'!$A$1:$C$6133,3,FALSE)","v":"N"}]
[null,null,null,null,75807,"Bundled","NA"]
[null,null,null,null,75809,"Bundled","NA"]
[null,null,null,null,75810,2408.9180478528747,{"$f":"VLOOKUP(E3989,'[1]Combined AA and BB'!$A$1:$C$6133,3,FALSE)","v":"N"}]
[null,null,null,null,75820,"Bundled","NA"]
[null,null,null,null,75822,247.68639999999999,{"$f":"VLOOKUP(E3991,'[1]Combined AA and BB'!$A$1:$C$6133,3,FALSE)","v":"N"}]
[null,null,null,null,75825,"Bundled","NA"]
[null,null,null,null,75827,"Bundled","NA"]
[null,null,null,null,75831,"Bundled","NA"]
[null,null,null,null,75833,"Bundled","NA"]
[null,null,null,null,75840,"Bundled","NA"]
[null,null,null,null,75842,"Bundled","NA"]
[null,null,null,null,75860,"Bundled","NA"]
[null,null,null,null,75870,293.53219999999999,{"$f":"VLOOKUP(E3999,'[1]Combined AA and BB'!$A$1:$C$6133,3,FALSE)","v":"N"}]
[null,null,null,null,75872,"Bundled","NA"]
[null,null,null,null,75880,"Bundled","NA"]
[null,null,null,null,75885,"Bundled","NA"]
[null,null,null,null,75887,258.40359999999998,{"$f":"VLOOKUP(E4003,'[1]Combined AA and BB'!$A$1:$C$6133,3,FALSE)","v":"N"}]
[null,null,null,null,75889,"Bundled","NA"]
[null,null,null,null,75891,"Bundled","NA"]
[null,null,null,null,75893,"Bundled","NA"]
[null,null,null,null,75894,"Bundled","NA"]
[null,null,null,null,75898,2408.9180478528747,{"$f":"VLOOKUP(E4008,'[1]Combined AA and BB'!$A$1:$C$6133,3,FALSE)","v":"N"}]
[null,null,null,null,75901,"Bundled","NA"]
[null,null,null,null,75902,"Bundled","NA"]
[null,null,null,null,75970,"Bundled","NA"]
[null,null,null,null,75984,"Bundled","NA"]
[null,null,null,null,75989,"Bundled","NA"]
[null,null,null,null,76000,81.569800000000001,{"$f":"VLOOKUP(E4014,'[1]Combined AA and BB'!$A$1:$C$6133,3,FALSE)","v":"N"}]
[null,null,null,null,76010,"Not covered","NA"]
[null,null,null,null,76080,"Bundled","NA"]
[null,null,null,null,76098,"Bundled","NA"]
[null,null,null,null,76100,"Bundled","NA"]
[null,null,null,null,76120,"Bundled","NA"]
[null,null,null,null,76125,"Bundled","NA"]
[null,null,null,null,76145,419.93108217162694,{"$f":"VLOOKUP(E4021,'[1]Combined AA and BB'!$A$1:$C$6133,3,FALSE)","v":"N"}]
[null,null,null,null,76376,"Bundled","NA"]
[null,null,null,null,76377,"Bundled","NA"]
[null,null,null,null,76380,"Bundled","NA"]
[null,null,null,null,76391,202.85033775915127,{"$f":"VLOOKUP(E4025,'[1]Combined AA and BB'!$A$1:$C$6133,3,FALSE)","v":"N"}]
[null,null,null,null,76496,"Bundled","NA"]
[null,null,null,null,76497,"Bundled","NA"]
[null,null,null,null,76498,75.468734129849267,{"$f":"VLOOKUP(E4028,'[1]Combined AA and BB'!$A$1:$C$6133,3,FALSE)","v":"N"}]
[null,null,null,null,76499,"Bundled","NA"]
[null,null,null,null,76506,"Bundled","NA"]
[null,null,null,null,76510,"Bundled","NA"]
[null,null,null,null,76511,"Bundled","NA"]
[null,null,null,null,76512,"Bundled","NA"]
[null,null,null,null,76513,"Bundled","NA"]
[null,null,null,null,76514,"Bundled","NA"]
[null,null,null,null,76516,"Bundled","NA"]
[null,null,null,null,76519,"Bundled","NA"]
[null,null,null,null,76529,"Bundled","NA"]
[null,null,null,null,76536,"Bundled","NA"]
[null,null,null,null,76604,"Bundled","NA"]
[null,null,null,null,76641,"Bundled","NA"]
[null,null,null,null,76642,"Bundled","NA"]
[null,null,null,null,76700,92.83934602035103,{"$f":"VLOOKUP(E4043,'[1]Combined AA and BB'!$A$1:$C$6133,3,FALSE)","v":"N"}]
[null,null,null,null,76705,92.83934602035103,{"$f":"VLOOKUP(E4044,'[1]Combined AA and BB'!$A$1:$C$6133,3,FALSE)","v":"N"}]
[null,null,null,null,76770,92.83934602035103,{"$f":"VLOOKUP(E4045,'[1]Combined AA and BB'!$A$1:$C$6133,3,FALSE)","v":"N"}]
[null,null,null,null,76775,"Bundled","NA"]
[null,null,null,null,76776,92.83934602035103,{"$f":"VLOOKUP(E4047,'[1]Combined AA and BB'!$A$1:$C$6133,3,FALSE)","v":"N"}]
[null,null,null,null,76800,"Bundled","NA"]
[null,null,null,null,76801,92.83934602035103,{"$f":"VLOOKUP(E4049,'[1]Combined AA and BB'!$A$1:$C$6133,3,FALSE)","v":"N"}]
[null,null,null,null,76802,"Bundled","NA"]
[null,null,null,null,76805,92.83934602035103,{"$f":"VLOOKUP(E4051,'[1]Combined AA and BB'!$A$1:$C$6133,3,FALSE)","v":"N"}]
[null,null,null,null,76810,"Bundled","NA"]
[null,null,null,null,76811,329.25620000000004,{"$f":"VLOOKUP(E4053,'[1]Combined AA and BB'!$A$1:$C$6133,3,FALSE)","v":"N"}]
[null,null,null,null,76812,"Bundled","NA"]
[null,null,null,null,76813,"Bundled","NA"]
[null,null,null,null,76814,"Bundled","NA"]
[null,null,null,null,76815,"Bundled","NA"]
[null,null,null,null,76816,"Bundled","NA"]
[null,null,null,null,76817,"Bundled","NA"]
[null,null,null,null,76818,92.83934602035103,{"$f":"VLOOKUP(E4060,'[1]Combined AA and BB'!$A$1:$C$6133,3,FALSE)","v":"N"}]
[null,null,null,null,76819,158.37640000000002,{"$f":"VLOOKUP(E4061,'[1]Combined AA and BB'!$A$1:$C$6133,3,FALSE)","v":"N"}]
[null,null,null,null,76820,"Bundled","NA"]
[null,null,null,null,76821,"Bundled","NA"]
[null,null,null,null,76825,497.15899999999999,{"$f":"VLOOKUP(E4064,'[1]Combined AA and BB'!$A$1:$C$6133,3,FALSE)","v":"N"}]
[null,null,null,null,76826,298.29539999999997,{"$f":"VLOOKUP(E4065,'[1]Combined AA and BB'!$A$1:$C$6133,3,FALSE)","v":"N"}]
[null,null,null,null,76827,"Bundled","NA"]
[null,null,null,null,76828,"Bundled","NA"]
[null,null,null,null,76830,92.83934602035103,{"$f":"VLOOKUP(E4068,'[1]Combined AA and BB'!$A$1:$C$6133,3,FALSE)","v":"N"}]
[null,null,null,null,76831,"Not covered","NA"]
[null,null,null,null,76856,92.83934602035103,{"$f":"VLOOKUP(E4070,'[1]Combined AA and BB'!$A$1:$C$6133,3,FALSE)","v":"N"}]
[null,null,null,null,76857,91.096199999999996,{"$f":"VLOOKUP(E4071,'[1]Combined AA and BB'!$A$1:$C$6133,3,FALSE)","v":"N"}]
[null,null,null,null,76870,"Bundled","NA"]
[null,null,null,null,76872,92.83934602035103,{"$f":"VLOOKUP(E4073,'[1]Combined AA and BB'!$A$1:$C$6133,3,FALSE)","v":"N"}]
[null,null,null,null,76873,"Not covered","NA"]
[null,null,null,null,76881,103.5996,{"$f":"VLOOKUP(E4075,'[1]Combined AA and BB'!$A$1:$C$6133,3,FALSE)","v":"N"}]
[null,null,null,null,76882,"Bundled","NA"]
[null,null,null,null,76885,"Not covered","NA"]
[null,null,null,null,76886,"Not covered","NA"]
[null,null,null,null,76932,"Bundled","NA"]
[null,null,null,null,76936,243.27507349835182,{"$f":"VLOOKUP(E4080,'[1]Combined AA and BB'!$A$1:$C$6133,3,FALSE)","v":"N"}]
[null,null,null,null,76937,"Bundled","NA"]
[null,null,null,null,76940,"Not covered","NA"]
[null,null,null,null,76941,"Bundled","NA"]
[null,null,null,null,76942,"Bundled","NA"]
[null,null,null,null,76945,"Not covered","NA"]
[null,null,null,null,76946,"Bundled","NA"]
[null,null,null,null,76948,"Not covered","NA"]
[null,null,null,null,76965,"Not covered","NA"]
[null,null,null,null,76975,"Bundled","NA"]
[null,null,null,null,76977,13.098800000000001,{"$f":"VLOOKUP(E4090,'[1]Combined AA and BB'!$A$1:$C$6133,3,FALSE)","v":"N"}]
[null,null,null,null,76978,156.64693232729377,{"$f":"VLOOKUP(E4091,'[1]Combined AA and BB'!$A$1:$C$6133,3,FALSE)","v":"N"}]
[null,null,null,null,76979,"Bundled","NA"]
[null,null,null,null,76981,92.83934602035103,{"$f":"VLOOKUP(E4093,'[1]Combined AA and BB'!$A$1:$C$6133,3,FALSE)","v":"N"}]
[null,null,null,null,76982,92.83934602035103,{"$f":"VLOOKUP(E4094,'[1]Combined AA and BB'!$A$1:$C$6133,3,FALSE)","v":"N"}]
[null,null,null,null,76983,"Bundled","NA"]
[null,null,null,null,76998,"Bundled","NA"]
[null,null,null,null,76999,"Bundled","NA"]
[null,null,null,null,77001,"Bundled","NA"]
[null,null,null,null,77002,"Bundled","NA"]
[null,null,null,null,77003,"Bundled","NA"]
[null,null,null,null,77011,"Bundled","NA"]
[null,null,null,null,77012,"Bundled","NA"]
[null,null,null,null,77013,"Bundled","NA"]
[null,null,null,null,77014,"Bundled","NA"]
[null,null,null,null,77021,"Not covered","NA"]
[null,null,null,null,77022,"Not covered","NA"]
[null,null,null,null,77046,202.85033775915127,{"$f":"VLOOKUP(E4107,'[1]Combined AA and BB'!$A$1:$C$6133,3,FALSE)","v":"N"}]
[null,null,null,null,77047,202.85033775915127,{"$f":"VLOOKUP(E4108,'[1]Combined AA and BB'!$A$1:$C$6133,3,FALSE)","v":"N"}]
[null,null,null,null,77053,"Not covered","NA"]
[null,null,null,null,77054,"Not covered","NA"]
[null,null,null,null,77071,"Bundled","NA"]
[null,null,null,null,77072,"Not covered","NA"]
[null,null,null,null,77073,"Bundled","NA"]
[null,null,null,null,77074,"Bundled","NA"]
[null,null,null,null,77075,"Bundled","NA"]
[null,null,null,null,77076,"Not covered","NA"]
[null,null,null,null,77077,"Bundled","NA"]
[null,null,null,null,77078,75.468734129849267,{"$f":"VLOOKUP(E4118,'[1]Combined AA and BB'!$A$1:$C$6133,3,FALSE)","v":"N"}]
[null,null,null,null,77080,72.043399999999991,{"$f":"VLOOKUP(E4119,'[1]Combined AA and BB'!$A$1:$C$6133,3,FALSE)","v":"N"}]
[null,null,null,null,77081,58.944600000000001,{"$f":"VLOOKUP(E4120,'[1]Combined AA and BB'!$A$1:$C$6133,3,FALSE)","v":"N"}]
[null,null,null,null,77084,202.85033775915127,{"$f":"VLOOKUP(E4121,'[1]Combined AA and BB'!$A$1:$C$6133,3,FALSE)","v":"N"}]
[null,null,null,null,77085,"Bundled","NA"]
[null,null,null,null,77086,"Bundled","NA"]
[null,null,null,null,77280,115.85886705651896,{"$f":"VLOOKUP(E4124,'[1]Combined AA and BB'!$A$1:$C$6133,3,FALSE)","v":"N"}]
[null,null,null,null,77285,311.6069775437071,{"$f":"VLOOKUP(E4125,'[1]Combined AA and BB'!$A$1:$C$6133,3,FALSE)","v":"N"}]
[null,null,null,null,77290,311.6069775437071,{"$f":"VLOOKUP(E4126,'[1]Combined AA and BB'!$A$1:$C$6133,3,FALSE)","v":"N"}]
[null,null,null,null,77295,896.077,{"$f":"VLOOKUP(E4127,'[1]Combined AA and BB'!$A$1:$C$6133,3,FALSE)","v":"N"}]
[null,null,null,null,77299,115.85886705651896,{"$f":"VLOOKUP(E4128,'[1]Combined AA and BB'!$A$1:$C$6133,3,FALSE)","v":"N"}]
[null,null,null,null,77300,123.24779999999998,{"$f":"VLOOKUP(E4129,'[1]Combined AA and BB'!$A$1:$C$6133,3,FALSE)","v":"N"}]
[null,null,null,null,77301,1164.5836078361647,{"$f":"VLOOKUP(E4130,'[1]Combined AA and BB'!$A$1:$C$6133,3,FALSE)","v":"N"}]
[null,null,null,null,77306,276.26559999999995,{"$f":"VLOOKUP(E4131,'[1]Combined AA and BB'!$A$1:$C$6133,3,FALSE)","v":"N"}]
[null,null,null,null,77307,534.07380000000001,{"$f":"VLOOKUP(E4132,'[1]Combined AA and BB'!$A$1:$C$6133,3,FALSE)","v":"N"}]
[null,null,null,null,77316,461.435,{"$f":"VLOOKUP(E4133,'[1]Combined AA and BB'!$A$1:$C$6133,3,FALSE)","v":"N"}]
[null,null,null,null,77317,311.6069775437071,{"$f":"VLOOKUP(E4134,'[1]Combined AA and BB'!$A$1:$C$6133,3,FALSE)","v":"N"}]
[null,null,null,null,77318,311.6069775437071,{"$f":"VLOOKUP(E4135,'[1]Combined AA and BB'!$A$1:$C$6133,3,FALSE)","v":"N"}]
[null,null,null,null,77321,175.04759999999999,{"$f":"VLOOKUP(E4136,'[1]Combined AA and BB'!$A$1:$C$6133,3,FALSE)","v":"N"}]
[null,null,null,null,77331,119.67539999999998,{"$f":"VLOOKUP(E4137,'[1]Combined AA and BB'!$A$1:$C$6133,3,FALSE)","v":"N"}]
[null,null,null,null,77332,70.852599999999995,{"$f":"VLOOKUP(E4138,'[1]Combined AA and BB'!$A$1:$C$6133,3,FALSE)","v":"N"}]
[null,null,null,null,77333,115.85886705651896,{"$f":"VLOOKUP(E4139,'[1]Combined AA and BB'!$A$1:$C$6133,3,FALSE)","v":"N"}]
[null,null,null,null,77334,233.9922,{"$f":"VLOOKUP(E4140,'[1]Combined AA and BB'!$A$1:$C$6133,3,FALSE)","v":"N"}]
[null,null,null,null,77336,115.85886705651896,{"$f":"VLOOKUP(E4141,'[1]Combined AA and BB'!$A$1:$C$6133,3,FALSE)","v":"N"}]
[null,null,null,null,77370,115.85886705651896,{"$f":"VLOOKUP(E4142,'[1]Combined AA and BB'!$A$1:$C$6133,3,FALSE)","v":"N"}]
[null,null,null,null,77371,"Not covered","NA"]
[null,null,null,null,77385,"Not covered","NA"]
[null,null,null,null,77386,"Not covered","NA"]
[null,null,null,null,77387,"Not covered","NA"]
[null,null,null,null,77399,115.85886705651896,{"$f":"VLOOKUP(E4147,'[1]Combined AA and BB'!$A$1:$C$6133,3,FALSE)","v":"N"}]
[null,null,null,null,77401,78.592799999999997,{"$f":"VLOOKUP(E4148,'[1]Combined AA and BB'!$A$1:$C$6133,3,FALSE)","v":"N"}]
[null,null,null,null,77402,106.30849079799609,{"$f":"VLOOKUP(E4149,'[1]Combined AA and BB'!$A$1:$C$6133,3,FALSE)","v":"N"}]
[null,null,null,null,77407,228.39586411007343,{"$f":"VLOOKUP(E4150,'[1]Combined AA and BB'!$A$1:$C$6133,3,FALSE)","v":"N"}]
[null,null,null,null,77412,228.39586411007343,{"$f":"VLOOKUP(E4151,'[1]Combined AA and BB'!$A$1:$C$6133,3,FALSE)","v":"N"}]
[null,null,null,null,77417,"Bundled","NA"]
[null,null,null,null,77423,"Not covered","NA"]
[null,null,null,null,77435,"Bundled","NA"]
[null,null,null,null,77470,256.61739999999998,{"$f":"VLOOKUP(E4155,'[1]Combined AA and BB'!$A$1:$C$6133,3,FALSE)","v":"N"}]
[null,null,null,null,77520,497.27701888127649,{"$f":"VLOOKUP(E4156,'[1]Combined AA and BB'!$A$1:$C$6133,3,FALSE)","v":"N"}]
[null,null,null,null,77522,1149.4275759476393,{"$f":"VLOOKUP(E4157,'[1]Combined AA and BB'!$A$1:$C$6133,3,FALSE)","v":"N"}]
[null,null,null,null,77523,1149.4275759476393,{"$f":"VLOOKUP(E4158,'[1]Combined AA and BB'!$A$1:$C$6133,3,FALSE)","v":"N"}]
[null,null,null,null,77525,1149.4275759476393,{"$f":"VLOOKUP(E4159,'[1]Combined AA and BB'!$A$1:$C$6133,3,FALSE)","v":"N"}]
[null,null,null,null,77600,228.39586411007343,{"$f":"VLOOKUP(E4160,'[1]Combined AA and BB'!$A$1:$C$6133,3,FALSE)","v":"N"}]
[null,null,null,null,77605,626.92510673135121,{"$f":"VLOOKUP(E4161,'[1]Combined AA and BB'!$A$1:$C$6133,3,FALSE)","v":"N"}]
[null,null,null,null,77610,497.27701888127649,{"$f":"VLOOKUP(E4162,'[1]Combined AA and BB'!$A$1:$C$6133,3,FALSE)","v":"N"}]
[null,null,null,null,77615,497.27701888127649,{"$f":"VLOOKUP(E4163,'[1]Combined AA and BB'!$A$1:$C$6133,3,FALSE)","v":"N"}]
[null,null,null,null,77620,497.27701888127649,{"$f":"VLOOKUP(E4164,'[1]Combined AA and BB'!$A$1:$C$6133,3,FALSE)","v":"N"}]
[null,null,null,null,77750,726.98340000000007,{"$f":"VLOOKUP(E4165,'[1]Combined AA and BB'!$A$1:$C$6133,3,FALSE)","v":"N"}]
[null,null,null,null,77761,782.35559999999998,{"$f":"VLOOKUP(E4166,'[1]Combined AA and BB'!$A$1:$C$6133,3,FALSE)","v":"N"}]
[null,null,null,null,77762,1024.6834000000001,{"$f":"VLOOKUP(E4167,'[1]Combined AA and BB'!$A$1:$C$6133,3,FALSE)","v":"N"}]
[null,null,null,null,77763,1442.6541999999999,{"$f":"VLOOKUP(E4168,'[1]Combined AA and BB'!$A$1:$C$6133,3,FALSE)","v":"N"}]
[null,null,null,null,77767,"Not covered","NA"]
[null,null,null,null,77768,"Not covered","NA"]
[null,null,null,null,77770,"Not covered","NA"]
[null,null,null,null,77771,"Not covered","NA"]
[null,null,null,null,77772,"Not covered","NA"]
[null,null,null,null,77778,626.92510673135121,{"$f":"VLOOKUP(E4174,'[1]Combined AA and BB'!$A$1:$C$6133,3,FALSE)","v":"N"}]
[null,null,null,null,77789,106.30849079799609,{"$f":"VLOOKUP(E4175,'[1]Combined AA and BB'!$A$1:$C$6133,3,FALSE)","v":"N"}]
[null,null,null,null,77790,"Bundled","NA"]
[null,null,null,null,77799,106.30849079799609,{"$f":"VLOOKUP(E4177,'[1]Combined AA and BB'!$A$1:$C$6133,3,FALSE)","v":"N"}]
[null,null,null,null,78012,337.63694327006158,{"$f":"VLOOKUP(E4178,'[1]Combined AA and BB'!$A$1:$C$6133,3,FALSE)","v":"N"}]
[null,null,null,null,78013,337.63694327006158,{"$f":"VLOOKUP(E4179,'[1]Combined AA and BB'!$A$1:$C$6133,3,FALSE)","v":"N"}]
[null,null,null,null,78014,337.63694327006158,{"$f":"VLOOKUP(E4180,'[1]Combined AA and BB'!$A$1:$C$6133,3,FALSE)","v":"N"}]
[null,null,null,null,78015,337.63694327006158,{"$f":"VLOOKUP(E4181,'[1]Combined AA and BB'!$A$1:$C$6133,3,FALSE)","v":"N"}]
[null,null,null,null,78016,337.63694327006158,{"$f":"VLOOKUP(E4182,'[1]Combined AA and BB'!$A$1:$C$6133,3,FALSE)","v":"N"}]
[null,null,null,null,78018,438.23597000046249,{"$f":"VLOOKUP(E4183,'[1]Combined AA and BB'!$A$1:$C$6133,3,FALSE)","v":"N"}]
[null,null,null,null,78020,"Bundled","NA"]
[null,null,null,null,78070,337.63694327006158,{"$f":"VLOOKUP(E4185,'[1]Combined AA and BB'!$A$1:$C$6133,3,FALSE)","v":"N"}]
[null,null,null,null,78071,337.63694327006158,{"$f":"VLOOKUP(E4186,'[1]Combined AA and BB'!$A$1:$C$6133,3,FALSE)","v":"N"}]
[null,null,null,null,78072,438.23597000046249,{"$f":"VLOOKUP(E4187,'[1]Combined AA and BB'!$A$1:$C$6133,3,FALSE)","v":"N"}]
[null,null,null,null,78075,1152.9397614195236,{"$f":"VLOOKUP(E4188,'[1]Combined AA and BB'!$A$1:$C$6133,3,FALSE)","v":"N"}]
[null,null,null,null,78099,337.63694327006158,{"$f":"VLOOKUP(E4189,'[1]Combined AA and BB'!$A$1:$C$6133,3,FALSE)","v":"N"}]
[null,null,null,null,78102,337.63694327006158,{"$f":"VLOOKUP(E4190,'[1]Combined AA and BB'!$A$1:$C$6133,3,FALSE)","v":"N"}]
[null,null,null,null,78103,337.63694327006158,{"$f":"VLOOKUP(E4191,'[1]Combined AA and BB'!$A$1:$C$6133,3,FALSE)","v":"N"}]
[null,null,null,null,78104,337.63694327006158,{"$f":"VLOOKUP(E4192,'[1]Combined AA and BB'!$A$1:$C$6133,3,FALSE)","v":"N"}]
[null,null,null,null,78110,1152.9397614195236,{"$f":"VLOOKUP(E4193,'[1]Combined AA and BB'!$A$1:$C$6133,3,FALSE)","v":"N"}]
[null,null,null,null,78111,1152.9397614195236,{"$f":"VLOOKUP(E4194,'[1]Combined AA and BB'!$A$1:$C$6133,3,FALSE)","v":"N"}]
[null,null,null,null,78120,337.63694327006158,{"$f":"VLOOKUP(E4195,'[1]Combined AA and BB'!$A$1:$C$6133,3,FALSE)","v":"N"}]
[null,null,null,null,78121,438.23597000046249,{"$f":"VLOOKUP(E4196,'[1]Combined AA and BB'!$A$1:$C$6133,3,FALSE)","v":"N"}]
[null,null,null,null,78122,438.23597000046249,{"$f":"VLOOKUP(E4197,'[1]Combined AA and BB'!$A$1:$C$6133,3,FALSE)","v":"N"}]
[null,null,null,null,78130,337.63694327006158,{"$f":"VLOOKUP(E4198,'[1]Combined AA and BB'!$A$1:$C$6133,3,FALSE)","v":"N"}]
[null,null,null,null,78140,337.63694327006158,{"$f":"VLOOKUP(E4199,'[1]Combined AA and BB'!$A$1:$C$6133,3,FALSE)","v":"N"}]
[null,null,null,null,78185,337.63694327006158,{"$f":"VLOOKUP(E4200,'[1]Combined AA and BB'!$A$1:$C$6133,3,FALSE)","v":"N"}]
[null,null,null,null,78191,337.63694327006158,{"$f":"VLOOKUP(E4201,'[1]Combined AA and BB'!$A$1:$C$6133,3,FALSE)","v":"N"}]
[null,null,null,null,78195,438.23597000046249,{"$f":"VLOOKUP(E4202,'[1]Combined AA and BB'!$A$1:$C$6133,3,FALSE)","v":"N"}]
[null,null,null,null,78199,337.63694327006158,{"$f":"VLOOKUP(E4203,'[1]Combined AA and BB'!$A$1:$C$6133,3,FALSE)","v":"N"}]
[null,null,null,null,78201,438.23597000046249,{"$f":"VLOOKUP(E4204,'[1]Combined AA and BB'!$A$1:$C$6133,3,FALSE)","v":"N"}]
[null,null,null,null,78202,438.23597000046249,{"$f":"VLOOKUP(E4205,'[1]Combined AA and BB'!$A$1:$C$6133,3,FALSE)","v":"N"}]
[null,null,null,null,78215,337.63694327006158,{"$f":"VLOOKUP(E4206,'[1]Combined AA and BB'!$A$1:$C$6133,3,FALSE)","v":"N"}]
[null,null,null,null,78216,337.63694327006158,{"$f":"VLOOKUP(E4207,'[1]Combined AA and BB'!$A$1:$C$6133,3,FALSE)","v":"N"}]
[null,null,null,null,78226,337.63694327006158,{"$f":"VLOOKUP(E4208,'[1]Combined AA and BB'!$A$1:$C$6133,3,FALSE)","v":"N"}]
[null,null,null,null,78227,438.23597000046249,{"$f":"VLOOKUP(E4209,'[1]Combined AA and BB'!$A$1:$C$6133,3,FALSE)","v":"N"}]
[null,null,null,null,78230,337.63694327006158,{"$f":"VLOOKUP(E4210,'[1]Combined AA and BB'!$A$1:$C$6133,3,FALSE)","v":"N"}]
[null,null,null,null,78231,337.63694327006158,{"$f":"VLOOKUP(E4211,'[1]Combined AA and BB'!$A$1:$C$6133,3,FALSE)","v":"N"}]
[null,null,null,null,78232,337.63694327006158,{"$f":"VLOOKUP(E4212,'[1]Combined AA and BB'!$A$1:$C$6133,3,FALSE)","v":"N"}]
[null,null,null,null,78258,337.63694327006158,{"$f":"VLOOKUP(E4213,'[1]Combined AA and BB'!$A$1:$C$6133,3,FALSE)","v":"N"}]
[null,null,null,null,78261,337.63694327006158,{"$f":"VLOOKUP(E4214,'[1]Combined AA and BB'!$A$1:$C$6133,3,FALSE)","v":"N"}]
[null,null,null,null,78262,337.63694327006158,{"$f":"VLOOKUP(E4215,'[1]Combined AA and BB'!$A$1:$C$6133,3,FALSE)","v":"N"}]
[null,null,null,null,78264,337.63694327006158,{"$f":"VLOOKUP(E4216,'[1]Combined AA and BB'!$A$1:$C$6133,3,FALSE)","v":"N"}]
[null,null,null,null,78265,337.63694327006158,{"$f":"VLOOKUP(E4217,'[1]Combined AA and BB'!$A$1:$C$6133,3,FALSE)","v":"N"}]
[null,null,null,null,78266,438.23597000046249,{"$f":"VLOOKUP(E4218,'[1]Combined AA and BB'!$A$1:$C$6133,3,FALSE)","v":"N"}]
[null,null,null,null,78278,337.63694327006158,{"$f":"VLOOKUP(E4219,'[1]Combined AA and BB'!$A$1:$C$6133,3,FALSE)","v":"N"}]
[null,null,null,null,78282,337.63694327006158,{"$f":"VLOOKUP(E4220,'[1]Combined AA and BB'!$A$1:$C$6133,3,FALSE)","v":"N"}]
[null,null,null,null,78290,337.63694327006158,{"$f":"VLOOKUP(E4221,'[1]Combined AA and BB'!$A$1:$C$6133,3,FALSE)","v":"N"}]
[null,null,null,null,78291,337.63694327006158,{"$f":"VLOOKUP(E4222,'[1]Combined AA and BB'!$A$1:$C$6133,3,FALSE)","v":"N"}]
[null,null,null,null,78299,337.63694327006158,{"$f":"VLOOKUP(E4223,'[1]Combined AA and BB'!$A$1:$C$6133,3,FALSE)","v":"N"}]
[null,null,null,null,78300,337.63694327006158,{"$f":"VLOOKUP(E4224,'[1]Combined AA and BB'!$A$1:$C$6133,3,FALSE)","v":"N"}]
[null,null,null,null,78305,337.63694327006158,{"$f":"VLOOKUP(E4225,'[1]Combined AA and BB'!$A$1:$C$6133,3,FALSE)","v":"N"}]
[null,null,null,null,78306,337.63694327006158,{"$f":"VLOOKUP(E4226,'[1]Combined AA and BB'!$A$1:$C$6133,3,FALSE)","v":"N"}]
[null,null,null,null,78315,337.63694327006158,{"$f":"VLOOKUP(E4227,'[1]Combined AA and BB'!$A$1:$C$6133,3,FALSE)","v":"N"}]
[null,null,null,null,78399,337.63694327006158,{"$f":"VLOOKUP(E4228,'[1]Combined AA and BB'!$A$1:$C$6133,3,FALSE)","v":"N"}]
[null,null,null,null,78414,438.23597000046249,{"$f":"VLOOKUP(E4229,'[1]Combined AA and BB'!$A$1:$C$6133,3,FALSE)","v":"N"}]
[null,null,null,null,78428,337.63694327006158,{"$f":"VLOOKUP(E4230,'[1]Combined AA and BB'!$A$1:$C$6133,3,FALSE)","v":"N"}]
[null,null,null,null,78429,1293.7386056076739,{"$f":"VLOOKUP(E4231,'[1]Combined AA and BB'!$A$1:$C$6133,3,FALSE)","v":"N"}]
[null,null,null,null,78430,1293.7386056076739,{"$f":"VLOOKUP(E4232,'[1]Combined AA and BB'!$A$1:$C$6133,3,FALSE)","v":"N"}]
[null,null,null,null,78431,2389.2463489290694,{"$f":"VLOOKUP(E4233,'[1]Combined AA and BB'!$A$1:$C$6133,3,FALSE)","v":"N"}]
[null,null,null,null,78432,1607.456354715765,{"$f":"VLOOKUP(E4234,'[1]Combined AA and BB'!$A$1:$C$6133,3,FALSE)","v":"N"}]
[null,null,null,null,78433,1694.3180648714065,{"$f":"VLOOKUP(E4235,'[1]Combined AA and BB'!$A$1:$C$6133,3,FALSE)","v":"N"}]
[null,null,null,null,78434,"Bundled","NA"]
[null,null,null,null,78445,337.63694327006158,{"$f":"VLOOKUP(E4237,'[1]Combined AA and BB'!$A$1:$C$6133,3,FALSE)","v":"N"}]
[null,null,null,null,78451,1152.9397614195236,{"$f":"VLOOKUP(E4238,'[1]Combined AA and BB'!$A$1:$C$6133,3,FALSE)","v":"N"}]
[null,null,null,null,78452,1152.9397614195236,{"$f":"VLOOKUP(E4239,'[1]Combined AA and BB'!$A$1:$C$6133,3,FALSE)","v":"N"}]
[null,null,null,null,78453,1152.9397614195236,{"$f":"VLOOKUP(E4240,'[1]Combined AA and BB'!$A$1:$C$6133,3,FALSE)","v":"N"}]
[null,null,null,null,78454,1152.9397614195236,{"$f":"VLOOKUP(E4241,'[1]Combined AA and BB'!$A$1:$C$6133,3,FALSE)","v":"N"}]
[null,null,null,null,78456,1152.9397614195236,{"$f":"VLOOKUP(E4242,'[1]Combined AA and BB'!$A$1:$C$6133,3,FALSE)","v":"N"}]
[null,null,null,null,78457,438.23597000046249,{"$f":"VLOOKUP(E4243,'[1]Combined AA and BB'!$A$1:$C$6133,3,FALSE)","v":"N"}]
[null,null,null,null,78458,337.63694327006158,{"$f":"VLOOKUP(E4244,'[1]Combined AA and BB'!$A$1:$C$6133,3,FALSE)","v":"N"}]
[null,null,null,null,78459,1152.9397614195236,{"$f":"VLOOKUP(E4245,'[1]Combined AA and BB'!$A$1:$C$6133,3,FALSE)","v":"N"}]
[null,null,null,null,78466,337.63694327006158,{"$f":"VLOOKUP(E4246,'[1]Combined AA and BB'!$A$1:$C$6133,3,FALSE)","v":"N"}]
[null,null,null,null,78468,438.23597000046249,{"$f":"VLOOKUP(E4247,'[1]Combined AA and BB'!$A$1:$C$6133,3,FALSE)","v":"N"}]
[null,null,null,null,78469,438.23597000046249,{"$f":"VLOOKUP(E4248,'[1]Combined AA and BB'!$A$1:$C$6133,3,FALSE)","v":"N"}]
[null,null,null,null,78472,337.63694327006158,{"$f":"VLOOKUP(E4249,'[1]Combined AA and BB'!$A$1:$C$6133,3,FALSE)","v":"N"}]
[null,null,null,null,78473,337.63694327006158,{"$f":"VLOOKUP(E4250,'[1]Combined AA and BB'!$A$1:$C$6133,3,FALSE)","v":"N"}]
[null,null,null,null,78481,438.23597000046249,{"$f":"VLOOKUP(E4251,'[1]Combined AA and BB'!$A$1:$C$6133,3,FALSE)","v":"N"}]
[null,null,null,null,78483,438.23597000046249,{"$f":"VLOOKUP(E4252,'[1]Combined AA and BB'!$A$1:$C$6133,3,FALSE)","v":"N"}]
[null,null,null,null,78491,1293.7386056076739,{"$f":"VLOOKUP(E4253,'[1]Combined AA and BB'!$A$1:$C$6133,3,FALSE)","v":"N"}]
[null,null,null,null,78492,1293.7386056076739,{"$f":"VLOOKUP(E4254,'[1]Combined AA and BB'!$A$1:$C$6133,3,FALSE)","v":"N"}]
[null,null,null,null,78494,337.63694327006158,{"$f":"VLOOKUP(E4255,'[1]Combined AA and BB'!$A$1:$C$6133,3,FALSE)","v":"N"}]
[null,null,null,null,78496,"Bundled","NA"]
[null,null,null,null,78499,337.63694327006158,{"$f":"VLOOKUP(E4257,'[1]Combined AA and BB'!$A$1:$C$6133,3,FALSE)","v":"N"}]
[null,null,null,null,78579,337.63694327006158,{"$f":"VLOOKUP(E4258,'[1]Combined AA and BB'!$A$1:$C$6133,3,FALSE)","v":"N"}]
[null,null,null,null,78580,337.63694327006158,{"$f":"VLOOKUP(E4259,'[1]Combined AA and BB'!$A$1:$C$6133,3,FALSE)","v":"N"}]
[null,null,null,null,78582,438.23597000046249,{"$f":"VLOOKUP(E4260,'[1]Combined AA and BB'!$A$1:$C$6133,3,FALSE)","v":"N"}]
[null,null,null,null,78597,337.63694327006158,{"$f":"VLOOKUP(E4261,'[1]Combined AA and BB'!$A$1:$C$6133,3,FALSE)","v":"N"}]
[null,null,null,null,78598,438.23597000046249,{"$f":"VLOOKUP(E4262,'[1]Combined AA and BB'!$A$1:$C$6133,3,FALSE)","v":"N"}]
[null,null,null,null,78599,337.63694327006158,{"$f":"VLOOKUP(E4263,'[1]Combined AA and BB'!$A$1:$C$6133,3,FALSE)","v":"N"}]
[null,null,null,null,78600,337.63694327006158,{"$f":"VLOOKUP(E4264,'[1]Combined AA and BB'!$A$1:$C$6133,3,FALSE)","v":"N"}]
[null,null,null,null,78601,337.63694327006158,{"$f":"VLOOKUP(E4265,'[1]Combined AA and BB'!$A$1:$C$6133,3,FALSE)","v":"N"}]
[null,null,null,null,78605,438.23597000046249,{"$f":"VLOOKUP(E4266,'[1]Combined AA and BB'!$A$1:$C$6133,3,FALSE)","v":"N"}]
[null,null,null,null,78606,438.23597000046249,{"$f":"VLOOKUP(E4267,'[1]Combined AA and BB'!$A$1:$C$6133,3,FALSE)","v":"N"}]
[null,null,null,null,78608,1293.7386056076739,{"$f":"VLOOKUP(E4268,'[1]Combined AA and BB'!$A$1:$C$6133,3,FALSE)","v":"N"}]
[null,null,null,null,78610,438.23597000046249,{"$f":"VLOOKUP(E4269,'[1]Combined AA and BB'!$A$1:$C$6133,3,FALSE)","v":"N"}]
[null,null,null,null,78630,438.23597000046249,{"$f":"VLOOKUP(E4270,'[1]Combined AA and BB'!$A$1:$C$6133,3,FALSE)","v":"N"}]
[null,null,null,null,78635,438.23597000046249,{"$f":"VLOOKUP(E4271,'[1]Combined AA and BB'!$A$1:$C$6133,3,FALSE)","v":"N"}]
[null,null,null,null,78645,438.23597000046249,{"$f":"VLOOKUP(E4272,'[1]Combined AA and BB'!$A$1:$C$6133,3,FALSE)","v":"N"}]
[null,null,null,null,78650,1152.9397614195236,{"$f":"VLOOKUP(E4273,'[1]Combined AA and BB'!$A$1:$C$6133,3,FALSE)","v":"N"}]
[null,null,null,null,78660,337.63694327006158,{"$f":"VLOOKUP(E4274,'[1]Combined AA and BB'!$A$1:$C$6133,3,FALSE)","v":"N"}]
[null,null,null,null,78699,337.63694327006158,{"$f":"VLOOKUP(E4275,'[1]Combined AA and BB'!$A$1:$C$6133,3,FALSE)","v":"N"}]
[null,null,null,null,78700,337.63694327006158,{"$f":"VLOOKUP(E4276,'[1]Combined AA and BB'!$A$1:$C$6133,3,FALSE)","v":"N"}]
[null,null,null,null,78701,337.63694327006158,{"$f":"VLOOKUP(E4277,'[1]Combined AA and BB'!$A$1:$C$6133,3,FALSE)","v":"N"}]
[null,null,null,null,78707,438.23597000046249,{"$f":"VLOOKUP(E4278,'[1]Combined AA and BB'!$A$1:$C$6133,3,FALSE)","v":"N"}]
[null,null,null,null,78708,438.23597000046249,{"$f":"VLOOKUP(E4279,'[1]Combined AA and BB'!$A$1:$C$6133,3,FALSE)","v":"N"}]
[null,null,null,null,78709,438.23597000046249,{"$f":"VLOOKUP(E4280,'[1]Combined AA and BB'!$A$1:$C$6133,3,FALSE)","v":"N"}]
[null,null,null,null,78725,337.63694327006158,{"$f":"VLOOKUP(E4281,'[1]Combined AA and BB'!$A$1:$C$6133,3,FALSE)","v":"N"}]
[null,null,null,null,78730,"Bundled","NA"]
[null,null,null,null,78740,337.63694327006158,{"$f":"VLOOKUP(E4283,'[1]Combined AA and BB'!$A$1:$C$6133,3,FALSE)","v":"N"}]
[null,null,null,null,78761,337.63694327006158,{"$f":"VLOOKUP(E4284,'[1]Combined AA and BB'!$A$1:$C$6133,3,FALSE)","v":"N"}]
[null,null,null,null,78799,337.63694327006158,{"$f":"VLOOKUP(E4285,'[1]Combined AA and BB'!$A$1:$C$6133,3,FALSE)","v":"N"}]
[null,null,null,null,78800,337.63694327006158,{"$f":"VLOOKUP(E4286,'[1]Combined AA and BB'!$A$1:$C$6133,3,FALSE)","v":"N"}]
[null,null,null,null,78801,337.63694327006158,{"$f":"VLOOKUP(E4287,'[1]Combined AA and BB'!$A$1:$C$6133,3,FALSE)","v":"N"}]
[null,null,null,null,78802,1152.9397614195236,{"$f":"VLOOKUP(E4288,'[1]Combined AA and BB'!$A$1:$C$6133,3,FALSE)","v":"N"}]
[null,null,null,null,78803,1152.9397614195236,{"$f":"VLOOKUP(E4289,'[1]Combined AA and BB'!$A$1:$C$6133,3,FALSE)","v":"N"}]
[null,null,null,null,78804,1152.9397614195236,{"$f":"VLOOKUP(E4290,'[1]Combined AA and BB'!$A$1:$C$6133,3,FALSE)","v":"N"}]
[null,null,null,null,78808,"Bundled","NA"]
[null,null,null,null,78811,"Not covered","NA"]
[null,null,null,null,78812,"Not covered","NA"]
[null,null,null,null,78813,"Not covered","NA"]
[null,null,null,null,78814,"Not covered","NA"]
[null,null,null,null,78815,1293.7386056076739,{"$f":"VLOOKUP(E4296,'[1]Combined AA and BB'!$A$1:$C$6133,3,FALSE)","v":"N"}]
[null,null,null,null,78816,"Not covered","NA"]
[null,null,null,null,78830,1152.9397614195236,{"$f":"VLOOKUP(E4298,'[1]Combined AA and BB'!$A$1:$C$6133,3,FALSE)","v":"N"}]
[null,null,null,null,78831,1152.9397614195236,{"$f":"VLOOKUP(E4299,'[1]Combined AA and BB'!$A$1:$C$6133,3,FALSE)","v":"N"}]
[null,null,null,null,78832,1293.7386056076739,{"$f":"VLOOKUP(E4300,'[1]Combined AA and BB'!$A$1:$C$6133,3,FALSE)","v":"N"}]
[null,null,null,null,78999,337.63694327006158,{"$f":"VLOOKUP(E4301,'[1]Combined AA and BB'!$A$1:$C$6133,3,FALSE)","v":"N"}]
[null,null,null,null,79005,249.47260000000003,{"$f":"VLOOKUP(E4302,'[1]Combined AA and BB'!$A$1:$C$6133,3,FALSE)","v":"N"}]
[null,null,null,null,79101,272.09780000000001,{"$f":"VLOOKUP(E4303,'[1]Combined AA and BB'!$A$1:$C$6133,3,FALSE)","v":"N"}]
[null,null,null,null,79200,242.92320000000001,{"$f":"VLOOKUP(E4304,'[1]Combined AA and BB'!$A$1:$C$6133,3,FALSE)","v":"N"}]
[null,null,null,null,79300,216.92503175608675,{"$f":"VLOOKUP(E4305,'[1]Combined AA and BB'!$A$1:$C$6133,3,FALSE)","v":"N"}]
[null,null,null,null,79403,370.93420000000003,{"$f":"VLOOKUP(E4306,'[1]Combined AA and BB'!$A$1:$C$6133,3,FALSE)","v":"N"}]
[null,null,null,null,79440,217.91640000000001,{"$f":"VLOOKUP(E4307,'[1]Combined AA and BB'!$A$1:$C$6133,3,FALSE)","v":"N"}]
[null,null,null,null,79445,216.92503175608675,{"$f":"VLOOKUP(E4308,'[1]Combined AA and BB'!$A$1:$C$6133,3,FALSE)","v":"N"}]
[null,null,null,null,79999,216.92503175608675,{"$f":"VLOOKUP(E4309,'[1]Combined AA and BB'!$A$1:$C$6133,3,FALSE)","v":"N"}]
[null,null,null,null,90371,131.76,{"$f":"VLOOKUP(E4310,'[1]Combined AA and BB'!$A$1:$C$6133,3,FALSE)","v":"N"}]
[null,null,null,null,90375,336.2,{"$f":"VLOOKUP(E4311,'[1]Combined AA and BB'!$A$1:$C$6133,3,FALSE)","v":"N"}]
[null,null,null,null,90376,296.74,{"$f":"VLOOKUP(E4312,'[1]Combined AA and BB'!$A$1:$C$6133,3,FALSE)","v":"N"}]
[null,null,null,null,90377,232.03,{"$f":"VLOOKUP(E4313,'[1]Combined AA and BB'!$A$1:$C$6133,3,FALSE)","v":"N"}]
[null,null,null,null,90385,"Not covered","NA"]
[null,null,null,null,90396,"Not covered","NA"]
[null,null,null,null,90476,"UR/BR",{"$f":"VLOOKUP(E4316,'[1]Combined AA and BB'!$A$1:$C$6133,3,FALSE)","v":"N"}]
[null,null,null,null,90585,"Not covered","NA"]
[null,null,null,null,90632,"Bundled","NA"]
[null,null,null,null,90633,"Not covered","NA"]
[null,null,null,null,90634,"Not covered","NA"]
[null,null,null,null,90636,"Bundled","NA"]
[null,null,null,null,90647,"Bundled","NA"]
[null,null,null,null,90648,"Bundled","NA"]
[null,null,null,null,90672,"Bundled","NA"]
[null,null,null,null,90674,"Bundled","NA"]
[null,null,null,null,90675,342.22,{"$f":"VLOOKUP(E4326,'[1]Combined AA and BB'!$A$1:$C$6133,3,FALSE)","v":"N"}]
[null,null,null,null,90676,"UR/BR",{"$f":"VLOOKUP(E4327,'[1]Combined AA and BB'!$A$1:$C$6133,3,FALSE)","v":"N"}]
[null,null,null,null,90680,"Not covered","NA"]
[null,null,null,null,90690,"Not covered","NA"]
[null,null,null,null,90691,"Not covered","NA"]
[null,null,null,null,90698,"Bundled","NA"]
[null,null,null,null,90700,"Not covered","NA"]
[null,null,null,null,90702,"Not covered","NA"]
[null,null,null,null,90707,"Not covered","NA"]
[null,null,null,null,90710,"Not covered","NA"]
[null,null,null,null,90713,"Not covered","NA"]
[null,null,null,null,90714,"Not covered","NA"]
[null,null,null,null,90715,"Not covered","NA"]
[null,null,null,null,90717,"Bundled","NA"]
[null,null,null,null,90733,"Not covered","NA"]
[null,null,null,null,90734,"Not covered","NA"]
[null,null,null,null,90749,"Bundled","NA"]
[null,null,null,null,90756,"Bundled","NA"]
[null,null,null,null,91200,"Not covered","NA"]
[null,null,null,null,92071,"Not covered","NA"]
[null,null,null,null,93261,"Not covered","NA"]
[null,null,null,null,93355,"Not covered","NA"]
[null,null,null,null,93590,"Not covered","NA"]
[null,null,null,null,93591,"Not covered","NA"]
[null,null,null,null,93644,"Not covered","NA"]
[null,null,null,null,93895,"Not covered","NA"]
[null,null,null,null,93985,202.85033775915127,{"$f":"VLOOKUP(E4352,'[1]Combined AA and BB'!$A$1:$C$6133,3,FALSE)","v":"N"}]
[null,null,null,null,93986,92.83934602035103,{"$f":"VLOOKUP(E4353,'[1]Combined AA and BB'!$A$1:$C$6133,3,FALSE)","v":"N"}]
[null,null,null,null,95940,"Not covered","NA"]
[null,null,null,null,95941,"Not covered","NA"]
[null,null,null,null,99497,"Not covered","NA"]
[null,null,null,null,99498,"Not covered","NA"]
[null,null,null,null,"0042T","Not covered","NA"]
[null,null,null,null,"0100T","Not covered","NA"]
[null,null,null,null,"0101T","Not covered","NA"]
[null,null,null,null,"0102T","Not covered","NA"]
[null,null,null,null,"0174T","Not covered","NA"]
[null,null,null,null,"0175T","Not covered","NA"]
[null,null,null,null,"0213T",740.24931776998312,{"$f":"VLOOKUP(E4364,'[1]Combined AA and BB'!$A$1:$C$6133,3,FALSE)","v":"Y"}]
[null,null,null,null,"0214T","Bundled","NA"]
[null,null,null,null,"0215T","Bundled","NA"]
[null,null,null,null,"0216T",740.24931776998312,{"$f":"VLOOKUP(E4367,'[1]Combined AA and BB'!$A$1:$C$6133,3,FALSE)","v":"Y"}]
[null,null,null,null,"0217T","Bundled","NA"]
[null,null,null,null,"0218T","Bundled","NA"]
[null,null,null,null,"0238T",21472.092365790264,{"$f":"VLOOKUP(E4370,'[1]Combined AA and BB'!$A$1:$C$6133,3,FALSE)","v":"Y"}]
[null,null,null,null,"0253T","Not covered","NA"]
[null,null,null,null,"0335T","Not covered","NA"]
[null,null,null,null,"0338T","Not covered","NA"]
[null,null,null,null,"0339T","Not covered","NA"]
[null,null,null,null,"0342T","Not covered","NA"]
[null,null,null,null,"0379T","Not covered","NA"]
[null,null,null,null,"0394T","Not covered","NA"]
[null,null,null,null,"0395T","Not covered","NA"]
[null,null,null,null,"0402T","Not covered","NA"]
[null,null,null,null,"0408T","Not covered","NA"]
[null,null,null,null,"0409T","Not covered","NA"]
[null,null,null,null,"0410T","Not covered","NA"]
[null,null,null,null,"0411T","Not covered","NA"]
[null,null,null,null,"0412T","Not covered","NA"]
[null,null,null,null,"0413T","Not covered","NA"]
[null,null,null,null,"0414T","Not covered","NA"]
[null,null,null,null,"0415T","Not covered","NA"]
[null,null,null,null,"0416T","Not covered","NA"]
[null,null,null,null,"0419T","Not covered","NA"]
[null,null,null,null,"0420T","Not covered","NA"]
[null,null,null,null,"0422T","Not covered","NA"]
[null,null,null,null,"0437T","Not covered","NA"]
[null,null,null,null,"0439T","Bundled","NA"]
[null,null,null,null,"0440T","Not covered","NA"]
[null,null,null,null,"0441T","Not covered","NA"]
[null,null,null,null,"0442T","Not covered","NA"]
[null,null,null,null,"0443T","Bundled","NA"]
[null,null,null,null,"0444T","Bundled","NA"]
[null,null,null,null,"0445T","Bundled","NA"]
[null,null,null,null,"0446T","Not covered","NA"]
[null,null,null,null,"0447T","Not covered","NA"]
[null,null,null,null,"0448T","Not covered","NA"]
[null,null,null,null,"0449T",6544.689455059317,{"$f":"VLOOKUP(E4403,'[1]Combined AA and BB'!$A$1:$C$6133,3,FALSE)","v":"Y"}]
[null,null,null,null,"0450T","Bundled","NA"]
[null,null,null,null,"0474T","Not covered","NA"]
[null,null,null,null,"0479T","Not covered","NA"]
[null,null,null,null,"0480T","Not covered","NA"]
[null,null,null,null,"0502T","Not covered","NA"]
[null,null,null,null,"0503T","Not covered","NA"]
[null,null,null,null,"0510T","Not covered","NA"]
[null,null,null,null,"0511T","Not covered","NA"]
[null,null,null,null,"0512T","Not covered","NA"]
[null,null,null,null,"0513T","Not covered","NA"]
[null,null,null,null,"0523T","Bundled","NA"]
[null,null,null,null,"0524T",4311.6015013806245,{"$f":"VLOOKUP(E4415,'[1]Combined AA and BB'!$A$1:$C$6133,3,FALSE)","v":"Y"}]
[null,null,null,null,"0525T","Not covered","NA"]
[null,null,null,null,"0526T","Not covered","NA"]
[null,null,null,null,"0527T","Not covered","NA"]
[null,null,null,null,"0530T","Not covered","NA"]
[null,null,null,null,"0531T","Not covered","NA"]
[null,null,null,null,"0532T","Not covered","NA"]
[null,null,null,null,"0558T","Not covered","NA"]
[null,null,null,null,"0566T","Not covered","NA"]
[null,null,null,null,"0587T","Not covered","NA"]
[null,null,null,null,"0588T","Not covered","NA"]
[null,null,null,null,"0620T","Not covered","NA"]
[null,null,null,null,"0627T","Not covered","NA"]
[null,null,null,null,"0628T","Not covered","NA"]
[null,null,null,null,"0629T","Not covered","NA"]
[null,null,null,null,"0630T","Not covered","NA"]
[null,null,null,null,"0633T","Not covered","NA"]
[null,null,null,null,"0634T","Not covered","NA"]
[null,null,null,null,"0635T","Not covered","NA"]
[null,null,null,null,"0636T","Not covered","NA"]
[null,null,null,null,"0637T","Not covered","NA"]
[null,null,null,null,"0638T","Not covered","NA"]
[null,null,null,null,"0671T","Not covered","NA"]
[null,null,null,null,"0673T","Not covered","NA"]
[null,null,null,null,"0686T","Not covered","NA"]
[null,null,null,null,"0689T","Not covered","NA"]
[null,null,null,null,"0697T","Not covered","NA"]
[null,null,null,null,"0699T","Not covered","NA"]
[null,null,null,null,"0707T","Not covered","NA"]
[null,null,null,null,"0775T","Not covered","NA"]
[null,null,null,null,"A4218","Not covered","NA"]
[null,null,null,null,"A4220","Not covered","NA"]
[null,null,null,null,"A4248","Not covered","NA"]
[null,null,null,null,"A4262","Not covered","NA"]
[null,null,null,null,"A4263","Not covered","NA"]
[null,null,null,null,"A4270","Not covered","NA"]
[null,null,null,null,"A4300","Not covered","NA"]
[null,null,null,null,"A4301","Not covered","NA"]
[null,null,null,null,"A4305","Not covered","NA"]
[null,null,null,null,"A4306","Not covered","NA"]
[null,null,null,null,"A4459","Not covered","NA"]
[null,null,null,null,"A4602","Not covered","NA"]
[null,null,null,null,"A4648","Not covered","NA"]
[null,null,null,null,"A4650","Not covered","NA"]
[null,null,null,null,"A7048","Not covered","NA"]
[null,null,null,null,"A9515","Not covered","NA"]
[null,null,null,null,"A9520","Bundled","NA"]
[null,null,null,null,"A9527","UR/BR",{"$f":"VLOOKUP(E4462,'[1]Combined AA and BB'!$A$1:$C$6133,3,FALSE)","v":"N"}]
[null,null,null,null,"A9575","Bundled","NA"]
[null,null,null,null,"A9576","Bundled","NA"]
[null,null,null,null,"A9577","Bundled","NA"]
[null,null,null,null,"A9578","Bundled","NA"]
[null,null,null,null,"A9579","Bundled","NA"]
[null,null,null,null,"A9580","Bundled","NA"]
[null,null,null,null,"A9581","Bundled","NA"]
[null,null,null,null,"A9582","Not covered","NA"]
[null,null,null,null,"A9583","Bundled","NA"]
[null,null,null,null,"A9584","Bundled","NA"]
[null,null,null,null,"A9585","Bundled","NA"]
[null,null,null,null,"A9587","Not covered","NA"]
[null,null,null,null,"A9588","Bundled","NA"]
[null,null,null,null,"A9590",346.21,{"$f":"VLOOKUP(E4476,'[1]Combined AA and BB'!$A$1:$C$6133,3,FALSE)","v":"N"}]
[null,null,null,null,"A9591",2168.1,{"$f":"VLOOKUP(E4477,'[1]Combined AA and BB'!$A$1:$C$6133,3,FALSE)","v":"N"}]
[null,null,null,null,"A9595",532.16999999999996,{"$f":"VLOOKUP(E4478,'[1]Combined AA and BB'!$A$1:$C$6133,3,FALSE)","v":"N"}]
[null,null,null,null,"A9597","Not covered","NA"]
[null,null,null,null,"A9598","Not covered","NA"]
[null,null,null,null,"A9606","Not covered","NA"]
[null,null,null,null,"A9698","Bundled","NA"]
[null,null,null,null,"C1052","UR/BR",{"$f":"VLOOKUP(E4483,'[1]Combined AA and BB'!$A$1:$C$6133,3,FALSE)","v":"N"}]
[null,null,null,null,"C1062","UR/BR",{"$f":"VLOOKUP(E4484,'[1]Combined AA and BB'!$A$1:$C$6133,3,FALSE)","v":"N"}]
[null,null,null,null,"C1713","Bundled","NA"]
[null,null,null,null,"C1714","Bundled","NA"]
[null,null,null,null,"C1715","Bundled","NA"]
[null,null,null,null,"C1716","Not covered","NA"]
[null,null,null,null,"C1717","Not covered","NA"]
[null,null,null,null,"C1719","Not covered","NA"]
[null,null,null,null,"C1721","Bundled","NA"]
[null,null,null,null,"C1722","Bundled","NA"]
[null,null,null,null,"C1724","Bundled","NA"]
[null,null,null,null,"C1725","Bundled","NA"]
[null,null,null,null,"C1726","Bundled","NA"]
[null,null,null,null,"C1727","Bundled","NA"]
[null,null,null,null,"C1728","Bundled","NA"]
[null,null,null,null,"C1729","Bundled","NA"]
[null,null,null,null,"C1730","Bundled","NA"]
[null,null,null,null,"C1731","Bundled","NA"]
[null,null,null,null,"C1732","Bundled","NA"]
[null,null,null,null,"C1733","Bundled","NA"]
[null,null,null,null,"C1734","Not covered","NA"]
[null,null,null,null,"C1747","UR/BR",{"$f":"VLOOKUP(E4504,'[1]Combined AA and BB'!$A$1:$C$6133,3,FALSE)","v":"N"}]
[null,null,null,null,"C1750","Bundled","NA"]
[null,null,null,null,"C1751","Bundled","NA"]
[null,null,null,null,"C1752","Bundled","NA"]
[null,null,null,null,"C1753","Bundled","NA"]
[null,null,null,null,"C1754","Bundled","NA"]
[null,null,null,null,"C1755","Bundled","NA"]
[null,null,null,null,"C1756","Bundled","NA"]
[null,null,null,null,"C1757","Bundled","NA"]
[null,null,null,null,"C1758","Bundled","NA"]
[null,null,null,null,"C1759","Bundled","NA"]
[null,null,null,null,"C1760","Bundled","NA"]
[null,null,null,null,"C1762","Bundled","NA"]
[null,null,null,null,"C1763","Bundled","NA"]
[null,null,null,null,"C1764","Bundled","NA"]
[null,null,null,null,"C1765","Bundled","NA"]
[null,null,null,null,"C1766","Bundled","NA"]
[null,null,null,null,"C1767","Bundled","NA"]
[null,null,null,null,"C1768","Bundled","NA"]
[null,null,null,null,"C1769","Bundled","NA"]
[null,null,null,null,"C1770","Bundled","NA"]
[null,null,null,null,"C1771","Bundled","NA"]
[null,null,null,null,"C1772","Bundled","NA"]
[null,null,null,null,"C1773","Bundled","NA"]
[null,null,null,null,"C1776","Bundled","NA"]
[null,null,null,null,"C1777","Bundled","NA"]
[null,null,null,null,"C1778","Bundled","NA"]
[null,null,null,null,"C1779","Bundled","NA"]
[null,null,null,null,"C1780","Bundled","NA"]
[null,null,null,null,"C1781","Bundled","NA"]
[null,null,null,null,"C1782","Bundled","NA"]
[null,null,null,null,"C1783","Bundled","NA"]
[null,null,null,null,"C1784","Bundled","NA"]
[null,null,null,null,"C1785","Bundled","NA"]
[null,null,null,null,"C1786","Bundled","NA"]
[null,null,null,null,"C1787","Bundled","NA"]
[null,null,null,null,"C1788","Bundled","NA"]
[null,null,null,null,"C1789","Bundled","NA"]
[null,null,null,null,"C1813","Bundled","NA"]
[null,null,null,null,"C1814","Bundled","NA"]
[null,null,null,null,"C1815","Bundled","NA"]
[null,null,null,null,"C1816","Bundled","NA"]
[null,null,null,null,"C1817","Bundled","NA"]
[null,null,null,null,"C1818","Bundled","NA"]
[null,null,null,null,"C1819","Bundled","NA"]
[null,null,null,null,"C1820","Not covered","NA"]
[null,null,null,null,"C1821","Not covered","NA"]
[null,null,null,null,"C1822","Not covered","NA"]
[null,null,null,null,"C1824","Bundled","NA"]
[null,null,null,null,"C1825","Not covered","NA"]
[null,null,null,null,"C1826","Not covered","NA"]
[null,null,null,null,"C1827","Not covered","NA"]
[null,null,null,null,"C1832","Not covered","NA"]
[null,null,null,null,"C1833","Not covered","NA"]
[null,null,null,null,"C1839","Bundled","NA"]
[null,null,null,null,"C1874","Bundled","NA"]
[null,null,null,null,"C1875","Bundled","NA"]
[null,null,null,null,"C1876","Bundled","NA"]
[null,null,null,null,"C1877","Bundled","NA"]
[null,null,null,null,"C1878","Bundled","NA"]
[null,null,null,null,"C1880","Bundled","NA"]
[null,null,null,null,"C1881","Bundled","NA"]
[null,null,null,null,"C1882","Bundled","NA"]
[null,null,null,null,"C1883","Bundled","NA"]
[null,null,null,null,"C1884","Bundled","NA"]
[null,null,null,null,"C1885","Bundled","NA"]
[null,null,null,null,"C1887","Bundled","NA"]
[null,null,null,null,"C1888","Bundled","NA"]
[null,null,null,null,"C1889","Bundled","NA"]
[null,null,null,null,"C1891","Bundled","NA"]
[null,null,null,null,"C1892","Bundled","NA"]
[null,null,null,null,"C1893","Bundled","NA"]
[null,null,null,null,"C1894","Bundled","NA"]
[null,null,null,null,"C1895","Bundled","NA"]
[null,null,null,null,"C1896","Bundled","NA"]
[null,null,null,null,"C1897","Bundled","NA"]
[null,null,null,null,"C1898","Bundled","NA"]
[null,null,null,null,"C1899","Bundled","NA"]
[null,null,null,null,"C1900","Bundled","NA"]
[null,null,null,null,"C1982","Bundled","NA"]
[null,null,null,null,"C2596","Not covered","NA"]
[null,null,null,null,"C2613","Not covered","NA"]
[null,null,null,null,"C2614","Not covered","NA"]
[null,null,null,null,"C2615","Bundled","NA"]
[null,null,null,null,"C2616","UR/BR",{"$f":"VLOOKUP(E4588,'[1]Combined AA and BB'!$A$1:$C$6133,3,FALSE)","v":"N"}]
[null,null,null,null,"C2617","Bundled","NA"]
[null,null,null,null,"C2618","Bundled","NA"]
[null,null,null,null,"C2619","Bundled","NA"]
[null,null,null,null,"C2620","Bundled","NA"]
[null,null,null,null,"C2621","Bundled","NA"]
[null,null,null,null,"C2622","Bundled","NA"]
[null,null,null,null,"C2624","Bundled","NA"]
[null,null,null,null,"C2625","Bundled","NA"]
[null,null,null,null,"C2626","Bundled","NA"]
[null,null,null,null,"C2627","Bundled","NA"]
[null,null,null,null,"C2628","Bundled","NA"]
[null,null,null,null,"C2629","Bundled","NA"]
[null,null,null,null,"C2630","Bundled","NA"]
[null,null,null,null,"C2631","Bundled","NA"]
[null,null,null,null,"C2634","Not covered","NA"]
[null,null,null,null,"C2635","Not covered","NA"]
[null,null,null,null,"C2636","Not covered","NA"]
[null,null,null,null,"C2638","Not covered","NA"]
[null,null,null,null,"C2639","Not covered","NA"]
[null,null,null,null,"C2640","Not covered","NA"]
[null,null,null,null,"C2641","Not covered","NA"]
[null,null,null,null,"C2642","Not covered","NA"]
[null,null,null,null,"C2643","Not covered","NA"]
[null,null,null,null,"C2698","Not covered","NA"]
[null,null,null,null,"C2699","Not covered","NA"]
[null,null,null,null,"C5271","Not covered","NA"]
[null,null,null,null,"C5272","Not covered","NA"]
[null,null,null,null,"C5273","Not covered","NA"]
[null,null,null,null,"C5274","Not covered","NA"]
[null,null,null,null,"C5275","Not covered","NA"]
[null,null,null,null,"C5276","Not covered","NA"]
[null,null,null,null,"C5277","Not covered","NA"]
[null,null,null,null,"C5278","Not covered","NA"]
[null,null,null,null,"C7500",1789.2422303467429,{"$f":"VLOOKUP(E4622,'[1]Combined AA and BB'!$A$1:$C$6133,3,FALSE)","v":"N"}]
[null,null,null,null,"C7501",1789.2422303467429,{"$f":"VLOOKUP(E4623,'[1]Combined AA and BB'!$A$1:$C$6133,3,FALSE)","v":"N"}]
[null,null,null,null,"C7502",1789.2422303467429,{"$f":"VLOOKUP(E4624,'[1]Combined AA and BB'!$A$1:$C$6133,3,FALSE)","v":"N"}]
[null,null,null,null,"C7503",4019.3242923368975,{"$f":"VLOOKUP(E4625,'[1]Combined AA and BB'!$A$1:$C$6133,3,FALSE)","v":"N"}]
[null,null,null,null,"C7504","Not covered","NA"]
[null,null,null,null,"C7505","Not covered","NA"]
[null,null,null,null,"C7506",5235.154665531295,{"$f":"VLOOKUP(E4628,'[1]Combined AA and BB'!$A$1:$C$6133,3,FALSE)","v":"N"}]
[null,null,null,null,"C7507","Not covered","NA"]
[null,null,null,null,"C7508","Not covered","NA"]
[null,null,null,null,"C7509",2357.8875500729591,{"$f":"VLOOKUP(E4631,'[1]Combined AA and BB'!$A$1:$C$6133,3,FALSE)","v":"N"}]
[null,null,null,null,"C7510",2357.8875500729591,{"$f":"VLOOKUP(E4632,'[1]Combined AA and BB'!$A$1:$C$6133,3,FALSE)","v":"N"}]
[null,null,null,null,"C7511",2357.8875500729591,{"$f":"VLOOKUP(E4633,'[1]Combined AA and BB'!$A$1:$C$6133,3,FALSE)","v":"N"}]
[null,null,null,null,"C7512",2357.8875500729591,{"$f":"VLOOKUP(E4634,'[1]Combined AA and BB'!$A$1:$C$6133,3,FALSE)","v":"N"}]
[null,null,null,null,"C7513",2408.9180478528747,{"$f":"VLOOKUP(E4635,'[1]Combined AA and BB'!$A$1:$C$6133,3,FALSE)","v":"N"}]
[null,null,null,null,"C7514",2408.9180478528747,{"$f":"VLOOKUP(E4636,'[1]Combined AA and BB'!$A$1:$C$6133,3,FALSE)","v":"N"}]
[null,null,null,null,"C7515",2408.9180478528747,{"$f":"VLOOKUP(E4637,'[1]Combined AA and BB'!$A$1:$C$6133,3,FALSE)","v":"N"}]
[null,null,null,null,"C7516",3882.2019969801527,{"$f":"VLOOKUP(E4638,'[1]Combined AA and BB'!$A$1:$C$6133,3,FALSE)","v":"N"}]
[null,null,null,null,"C7517",3882.2019969801527,{"$f":"VLOOKUP(E4639,'[1]Combined AA and BB'!$A$1:$C$6133,3,FALSE)","v":"N"}]
[null,null,null,null,"C7518",3882.2019969801527,{"$f":"VLOOKUP(E4640,'[1]Combined AA and BB'!$A$1:$C$6133,3,FALSE)","v":"N"}]
[null,null,null,null,"C7519",3882.2019969801527,{"$f":"VLOOKUP(E4641,'[1]Combined AA and BB'!$A$1:$C$6133,3,FALSE)","v":"N"}]
[null,null,null,null,"C7520",3882.2019969801527,{"$f":"VLOOKUP(E4642,'[1]Combined AA and BB'!$A$1:$C$6133,3,FALSE)","v":"N"}]
[null,null,null,null,"C7521",3882.2019969801527,{"$f":"VLOOKUP(E4643,'[1]Combined AA and BB'!$A$1:$C$6133,3,FALSE)","v":"N"}]
[null,null,null,null,"C7522",3882.2019969801527,{"$f":"VLOOKUP(E4644,'[1]Combined AA and BB'!$A$1:$C$6133,3,FALSE)","v":"N"}]
[null,null,null,null,"C7523",3882.2019969801527,{"$f":"VLOOKUP(E4645,'[1]Combined AA and BB'!$A$1:$C$6133,3,FALSE)","v":"N"}]
[null,null,null,null,"C7524",3882.2019969801527,{"$f":"VLOOKUP(E4646,'[1]Combined AA and BB'!$A$1:$C$6133,3,FALSE)","v":"N"}]
[null,null,null,null,"C7525",3882.2019969801527,{"$f":"VLOOKUP(E4647,'[1]Combined AA and BB'!$A$1:$C$6133,3,FALSE)","v":"N"}]
[null,null,null,null,"C7526",3882.2019969801527,{"$f":"VLOOKUP(E4648,'[1]Combined AA and BB'!$A$1:$C$6133,3,FALSE)","v":"N"}]
[null,null,null,null,"C7527",3882.2019969801527,{"$f":"VLOOKUP(E4649,'[1]Combined AA and BB'!$A$1:$C$6133,3,FALSE)","v":"N"}]
[null,null,null,null,"C7528",3882.2019969801527,{"$f":"VLOOKUP(E4650,'[1]Combined AA and BB'!$A$1:$C$6133,3,FALSE)","v":"N"}]
[null,null,null,null,"C7529",3882.2019969801527,{"$f":"VLOOKUP(E4651,'[1]Combined AA and BB'!$A$1:$C$6133,3,FALSE)","v":"N"}]
[null,null,null,null,"C7530",7639.6089505676864,{"$f":"VLOOKUP(E4652,'[1]Combined AA and BB'!$A$1:$C$6133,3,FALSE)","v":"N"}]
[null,null,null,null,"C7531",12033.617505290766,{"$f":"VLOOKUP(E4653,'[1]Combined AA and BB'!$A$1:$C$6133,3,FALSE)","v":"N"}]
[null,null,null,null,"C7532",11610.427384538929,{"$f":"VLOOKUP(E4654,'[1]Combined AA and BB'!$A$1:$C$6133,3,FALSE)","v":"N"}]
[null,null,null,null,"C7533",12130.949298037987,{"$f":"VLOOKUP(E4655,'[1]Combined AA and BB'!$A$1:$C$6133,3,FALSE)","v":"N"}]
[null,null,null,null,"C7534",22142.282825989503,{"$f":"VLOOKUP(E4656,'[1]Combined AA and BB'!$A$1:$C$6133,3,FALSE)","v":"N"}]
[null,null,null,null,"C7535",21949.816063790604,{"$f":"VLOOKUP(E4657,'[1]Combined AA and BB'!$A$1:$C$6133,3,FALSE)","v":"N"}]
[null,null,null,null,"C7537",22165.673871960211,{"$f":"VLOOKUP(E4658,'[1]Combined AA and BB'!$A$1:$C$6133,3,FALSE)","v":"N"}]
[null,null,null,null,"C7538",22104.583972337437,{"$f":"VLOOKUP(E4659,'[1]Combined AA and BB'!$A$1:$C$6133,3,FALSE)","v":"N"}]
[null,null,null,null,"C7539",22527.216350387298,{"$f":"VLOOKUP(E4660,'[1]Combined AA and BB'!$A$1:$C$6133,3,FALSE)","v":"N"}]
[null,null,null,null,"C7540",22143.990201607801,{"$f":"VLOOKUP(E4661,'[1]Combined AA and BB'!$A$1:$C$6133,3,FALSE)","v":"N"}]
[null,null,null,null,"C7541",3792.6585688533673,{"$f":"VLOOKUP(E4662,'[1]Combined AA and BB'!$A$1:$C$6133,3,FALSE)","v":"N"}]
[null,null,null,null,"C7542",3792.6585688533673,{"$f":"VLOOKUP(E4663,'[1]Combined AA and BB'!$A$1:$C$6133,3,FALSE)","v":"N"}]
[null,null,null,null,"C7543",3792.6585688533673,{"$f":"VLOOKUP(E4664,'[1]Combined AA and BB'!$A$1:$C$6133,3,FALSE)","v":"N"}]
[null,null,null,null,"C7544",3792.6585688533673,{"$f":"VLOOKUP(E4665,'[1]Combined AA and BB'!$A$1:$C$6133,3,FALSE)","v":"N"}]
[null,null,null,null,"C7545",3792.6585688533673,{"$f":"VLOOKUP(E4666,'[1]Combined AA and BB'!$A$1:$C$6133,3,FALSE)","v":"N"}]
[null,null,null,null,"C7546",2496.688081837452,{"$f":"VLOOKUP(E4667,'[1]Combined AA and BB'!$A$1:$C$6133,3,FALSE)","v":"N"}]
[null,null,null,null,"C7547",3807.0606236688513,{"$f":"VLOOKUP(E4668,'[1]Combined AA and BB'!$A$1:$C$6133,3,FALSE)","v":"N"}]
[null,null,null,null,"C7548",2496.688081837452,{"$f":"VLOOKUP(E4669,'[1]Combined AA and BB'!$A$1:$C$6133,3,FALSE)","v":"N"}]
[null,null,null,null,"C7549",2496.688081837452,{"$f":"VLOOKUP(E4670,'[1]Combined AA and BB'!$A$1:$C$6133,3,FALSE)","v":"N"}]
[null,null,null,null,"C7550",2496.688081837452,{"$f":"VLOOKUP(E4671,'[1]Combined AA and BB'!$A$1:$C$6133,3,FALSE)","v":"N"}]
[null,null,null,null,"C7551",4390.2750933710631,{"$f":"VLOOKUP(E4672,'[1]Combined AA and BB'!$A$1:$C$6133,3,FALSE)","v":"N"}]
[null,null,null,null,"C7552",3882.2019969801527,{"$f":"VLOOKUP(E4673,'[1]Combined AA and BB'!$A$1:$C$6133,3,FALSE)","v":"N"}]
[null,null,null,null,"C7553",3882.2019969801527,{"$f":"VLOOKUP(E4674,'[1]Combined AA and BB'!$A$1:$C$6133,3,FALSE)","v":"N"}]
[null,null,null,null,"C7554",1414.7446410281614,{"$f":"VLOOKUP(E4675,'[1]Combined AA and BB'!$A$1:$C$6133,3,FALSE)","v":"N"}]
[null,null,null,null,"C7555",7140.4028248878139,{"$f":"VLOOKUP(E4676,'[1]Combined AA and BB'!$A$1:$C$6133,3,FALSE)","v":"N"}]
[null,null,null,null,"C8900",320.03276239497637,{"$f":"VLOOKUP(E4677,'[1]Combined AA and BB'!$A$1:$C$6133,3,FALSE)","v":"N"}]
[null,null,null,null,"C8901",202.85033775915127,{"$f":"VLOOKUP(E4678,'[1]Combined AA and BB'!$A$1:$C$6133,3,FALSE)","v":"N"}]
[null,null,null,null,"C8902",320.03276239497637,{"$f":"VLOOKUP(E4679,'[1]Combined AA and BB'!$A$1:$C$6133,3,FALSE)","v":"N"}]
[null,null,null,null,"C8903",156.64693232729377,{"$f":"VLOOKUP(E4680,'[1]Combined AA and BB'!$A$1:$C$6133,3,FALSE)","v":"N"}]
[null,null,null,null,"C8905",320.03276239497637,{"$f":"VLOOKUP(E4681,'[1]Combined AA and BB'!$A$1:$C$6133,3,FALSE)","v":"N"}]
[null,null,null,null,"C8906",320.03276239497637,{"$f":"VLOOKUP(E4682,'[1]Combined AA and BB'!$A$1:$C$6133,3,FALSE)","v":"N"}]
[null,null,null,null,"C8908",320.03276239497637,{"$f":"VLOOKUP(E4683,'[1]Combined AA and BB'!$A$1:$C$6133,3,FALSE)","v":"N"}]
[null,null,null,null,"C8909",320.03276239497637,{"$f":"VLOOKUP(E4684,'[1]Combined AA and BB'!$A$1:$C$6133,3,FALSE)","v":"N"}]
[null,null,null,null,"C8910",202.85033775915127,{"$f":"VLOOKUP(E4685,'[1]Combined AA and BB'!$A$1:$C$6133,3,FALSE)","v":"N"}]
[null,null,null,null,"C8911",320.03276239497637,{"$f":"VLOOKUP(E4686,'[1]Combined AA and BB'!$A$1:$C$6133,3,FALSE)","v":"N"}]
[null,null,null,null,"C8912",320.03276239497637,{"$f":"VLOOKUP(E4687,'[1]Combined AA and BB'!$A$1:$C$6133,3,FALSE)","v":"N"}]
[null,null,null,null,"C8913",202.85033775915127,{"$f":"VLOOKUP(E4688,'[1]Combined AA and BB'!$A$1:$C$6133,3,FALSE)","v":"N"}]
[null,null,null,null,"C8914",320.03276239497637,{"$f":"VLOOKUP(E4689,'[1]Combined AA and BB'!$A$1:$C$6133,3,FALSE)","v":"N"}]
[null,null,null,null,"C8918",320.03276239497637,{"$f":"VLOOKUP(E4690,'[1]Combined AA and BB'!$A$1:$C$6133,3,FALSE)","v":"N"}]
[null,null,null,null,"C8919",202.85033775915127,{"$f":"VLOOKUP(E4691,'[1]Combined AA and BB'!$A$1:$C$6133,3,FALSE)","v":"N"}]
[null,null,null,null,"C8920",320.03276239497637,{"$f":"VLOOKUP(E4692,'[1]Combined AA and BB'!$A$1:$C$6133,3,FALSE)","v":"N"}]
[null,null,null,null,"C9047","Not covered","NA"]
[null,null,null,null,"C9054","Not covered","NA"]
[null,null,null,null,"C9055","Not covered","NA"]
[null,null,null,null,"C9067","UR/BR",{"$f":"VLOOKUP(E4696,'[1]Combined AA and BB'!$A$1:$C$6133,3,FALSE)","v":"N"}]
[null,null,null,null,"C9088","UR/BR",{"$f":"VLOOKUP(E4697,'[1]Combined AA and BB'!$A$1:$C$6133,3,FALSE)","v":"N"}]
[null,null,null,null,"C9089","UR/BR",{"$f":"VLOOKUP(E4698,'[1]Combined AA and BB'!$A$1:$C$6133,3,FALSE)","v":"N"}]
[null,null,null,null,"C9113","Bundled","NA"]
[null,null,null,null,"C9144","UR/BR",{"$f":"VLOOKUP(E4700,'[1]Combined AA and BB'!$A$1:$C$6133,3,FALSE)","v":"N"}]
[null,null,null,null,"C9248",3.9876,{"$f":"VLOOKUP(E4701,'[1]Combined AA and BB'!$A$1:$C$6133,3,FALSE)","v":"N"}]
[null,null,null,null,"C9254","Bundled","NA"]
[null,null,null,null,"C9290",1.74,{"$f":"VLOOKUP(E4703,'[1]Combined AA and BB'!$A$1:$C$6133,3,FALSE)","v":"N"}]
[null,null,null,null,"C9293","Bundled","NA"]
[null,null,null,null,"C9352","Bundled","NA"]
[null,null,null,null,"C9353","Bundled","NA"]
[null,null,null,null,"C9399","UR/BR",{"$f":"VLOOKUP(E4707,'[1]Combined AA and BB'!$A$1:$C$6133,3,FALSE)","v":"N"}]
[null,null,null,null,"C9460",19.267020000000002,{"$f":"VLOOKUP(E4708,'[1]Combined AA and BB'!$A$1:$C$6133,3,FALSE)","v":"N"}]
[null,null,null,null,"C9488","UR/BR",{"$f":"VLOOKUP(E4709,'[1]Combined AA and BB'!$A$1:$C$6133,3,FALSE)","v":"N"}]
[null,null,null,null,"C9725","Not covered","NA"]
[null,null,null,null,"C9726","Not covered","NA"]
[null,null,null,null,"C9727",985.80817689537298,{"$f":"VLOOKUP(E4712,'[1]Combined AA and BB'!$A$1:$C$6133,3,FALSE)","v":"Y"}]
[null,null,null,null,"C9738","Bundled","NA"]
[null,null,null,null,"C9754","Not covered","NA"]
[null,null,null,null,"C9755","Not covered","NA"]
[null,null,null,null,"C9757",18390.33628727937,{"$f":"VLOOKUP(E4716,'[1]Combined AA and BB'!$A$1:$C$6133,3,FALSE)","v":"Y"}]
[null,null,null,null,"C9761",7141.8820951235084,{"$f":"VLOOKUP(E4717,'[1]Combined AA and BB'!$A$1:$C$6133,3,FALSE)","v":"Y"}]
[null,null,null,null,"C9769",15968.913420398068,{"$f":"VLOOKUP(E4718,'[1]Combined AA and BB'!$A$1:$C$6133,3,FALSE)","v":"Y"}]
[null,null,null,null,"C9770",3257.8980532980154,{"$f":"VLOOKUP(E4719,'[1]Combined AA and BB'!$A$1:$C$6133,3,FALSE)","v":"Y"}]
[null,null,null,null,"C9771",8011.1771386254304,{"$f":"VLOOKUP(E4720,'[1]Combined AA and BB'!$A$1:$C$6133,3,FALSE)","v":"Y"}]
[null,null,null,null,"C9772",14906.356660609366,{"$f":"VLOOKUP(E4721,'[1]Combined AA and BB'!$A$1:$C$6133,3,FALSE)","v":"Y"}]
[null,null,null,null,"C9773",24124.682508885264,{"$f":"VLOOKUP(E4722,'[1]Combined AA and BB'!$A$1:$C$6133,3,FALSE)","v":"Y"}]
[null,null,null,null,"C9774",25837.737996742144,{"$f":"VLOOKUP(E4723,'[1]Combined AA and BB'!$A$1:$C$6133,3,FALSE)","v":"Y"}]
[null,null,null,null,"C9775",24536.80883563052,{"$f":"VLOOKUP(E4724,'[1]Combined AA and BB'!$A$1:$C$6133,3,FALSE)","v":"Y"}]
[null,null,null,null,"G0104",353.66759999999999,{"$f":"VLOOKUP(E4725,'[1]Combined AA and BB'!$A$1:$C$6133,3,FALSE)","v":"Y"}]
[null,null,null,null,"G0105",721.89252572235137,{"$f":"VLOOKUP(E4726,'[1]Combined AA and BB'!$A$1:$C$6133,3,FALSE)","v":"Y"}]
[null,null,null,null,"G0121",721.89252572235137,{"$f":"VLOOKUP(E4727,'[1]Combined AA and BB'!$A$1:$C$6133,3,FALSE)","v":"Y"}]
[null,null,null,null,"G0127","Not covered","NA"]
[null,null,null,null,"G0130",67.280199999999994,{"$f":"VLOOKUP(E4729,'[1]Combined AA and BB'!$A$1:$C$6133,3,FALSE)","v":"N"}]
[null,null,null,null,"G0186",461.05652486457785,{"$f":"VLOOKUP(E4730,'[1]Combined AA and BB'!$A$1:$C$6133,3,FALSE)","v":"Y"}]
[null,null,null,null,"G0247","Not covered","NA"]
[null,null,null,null,"G0259","Not covered","NA"]
[null,null,null,null,"G0260",559.70914339011665,{"$f":"VLOOKUP(E4733,'[1]Combined AA and BB'!$A$1:$C$6133,3,FALSE)","v":"Y"}]
[null,null,null,null,"G0268","Not covered","NA"]
[null,null,null,null,"G0269","Not covered","NA"]
[null,null,null,null,"G0276","Not covered","NA"]
[null,null,null,null,"G0288","Not covered","NA"]
[null,null,null,null,"G0289","Not covered","NA"]
[null,null,null,null,"G0339","Not covered","NA"]
[null,null,null,null,"G0340","Not covered","NA"]
[null,null,null,null,"G0453","Not covered","NA"]
[null,null,null,null,"G0458","Not covered","NA"]
[null,null,null,null,"G0464","Not covered","NA"]
[null,null,null,null,"G0472","Not covered","NA"]
[null,null,null,null,"G0516","Bundled","NA"]
[null,null,null,null,"G0517","Bundled","NA"]
[null,null,null,null,"G0518","Bundled","NA"]
[null,null,null,null,"J0120","Not covered","NA"]
[null,null,null,null,"J0129",42.76,{"$f":"VLOOKUP(E4749,'[1]Combined AA and BB'!$A$1:$C$6133,3,FALSE)","v":"N"}]
[null,null,null,null,"J0130","Bundled","NA"]
[null,null,null,null,"J0131","Bundled","NA"]
[null,null,null,null,"J0132","Bundled","NA"]
[null,null,null,null,"J0133","Bundled","NA"]
[null,null,null,null,"J0135","Not covered","NA"]
[null,null,null,null,"J0153","Bundled","NA"]
[null,null,null,null,"J0171","Bundled","NA"]
[null,null,null,null,"J0172","Not covered","NA"]
[null,null,null,null,"J0178","Not covered","NA"]
[null,null,null,null,"J0179","Not covered","NA"]
[null,null,null,null,"J0180",208.17,{"$f":"VLOOKUP(E4760,'[1]Combined AA and BB'!$A$1:$C$6133,3,FALSE)","v":"N"}]
[null,null,null,null,"J0185",1.81,{"$f":"VLOOKUP(E4761,'[1]Combined AA and BB'!$A$1:$C$6133,3,FALSE)","v":"N"}]
[null,null,null,null,"J0190","Not covered","NA"]
[null,null,null,null,"J0200","Not covered","NA"]
[null,null,null,null,"J0202","Not covered","NA"]
[null,null,null,null,"J0205","Not covered","NA"]
[null,null,null,null,"J0207","Bundled","NA"]
[null,null,null,null,"J0210","Bundled","NA"]
[null,null,null,null,"J0215","Not covered","NA"]
[null,null,null,null,"J0220","Not covered","NA"]
[null,null,null,null,"J0225","Not covered","NA"]
[null,null,null,null,"J0256",4.78,{"$f":"VLOOKUP(E4771,'[1]Combined AA and BB'!$A$1:$C$6133,3,FALSE)","v":"N"}]
[null,null,null,null,"J0278","Not covered","NA"]
[null,null,null,null,"J0280","Bundled","NA"]
[null,null,null,null,"J0282","Bundled","NA"]
[null,null,null,null,"J0285","Bundled","NA"]
[null,null,null,null,"J0287",11.13,{"$f":"VLOOKUP(E4776,'[1]Combined AA and BB'!$A$1:$C$6133,3,FALSE)","v":"N"}]
[null,null,null,null,"J0288","Not covered","NA"]
[null,null,null,null,"J0289",26.85,{"$f":"VLOOKUP(E4778,'[1]Combined AA and BB'!$A$1:$C$6133,3,FALSE)","v":"N"}]
[null,null,null,null,"J0290","Bundled","NA"]
[null,null,null,null,"J0295","Bundled","NA"]
[null,null,null,null,"J0300",183.26,{"$f":"VLOOKUP(E4781,'[1]Combined AA and BB'!$A$1:$C$6133,3,FALSE)","v":"N"}]
[null,null,null,null,"J0330","Bundled","NA"]
[null,null,null,null,"J0348","Bundled","NA"]
[null,null,null,null,"J0360","Bundled","NA"]
[null,null,null,null,"J0364","Bundled","NA"]
[null,null,null,null,"J0365","Not covered","NA"]
[null,null,null,null,"J0380","Not covered","NA"]
[null,null,null,null,"J0390","Not covered","NA"]
[null,null,null,null,"J0400",0.76,{"$f":"VLOOKUP(E4789,'[1]Combined AA and BB'!$A$1:$C$6133,3,FALSE)","v":"N"}]
[null,null,null,null,"J0401",6.42,{"$f":"VLOOKUP(E4790,'[1]Combined AA and BB'!$A$1:$C$6133,3,FALSE)","v":"N"}]
[null,null,null,null,"J0456","Bundled","NA"]
[null,null,null,null,"J0461","Bundled","NA"]
[null,null,null,null,"J0470",57.76,{"$f":"VLOOKUP(E4793,'[1]Combined AA and BB'!$A$1:$C$6133,3,FALSE)","v":"N"}]
[null,null,null,null,"J0475",178.45,{"$f":"VLOOKUP(E4794,'[1]Combined AA and BB'!$A$1:$C$6133,3,FALSE)","v":"N"}]
[null,null,null,null,"J0476","Bundled","NA"]
[null,null,null,null,"J0480",4310.97,{"$f":"VLOOKUP(E4796,'[1]Combined AA and BB'!$A$1:$C$6133,3,FALSE)","v":"N"}]
[null,null,null,null,"J0485",3.79,{"$f":"VLOOKUP(E4797,'[1]Combined AA and BB'!$A$1:$C$6133,3,FALSE)","v":"N"}]
[null,null,null,null,"J0500","Bundled","NA"]
[null,null,null,null,"J0515","Bundled","NA"]
[null,null,null,null,"J0517",167.12,{"$f":"VLOOKUP(E4800,'[1]Combined AA and BB'!$A$1:$C$6133,3,FALSE)","v":"N"}]
[null,null,null,null,"J0520","Not covered","NA"]
[null,null,null,null,"J0558",14.42,{"$f":"VLOOKUP(E4802,'[1]Combined AA and BB'!$A$1:$C$6133,3,FALSE)","v":"N"}]
[null,null,null,null,"J0561",18.59,{"$f":"VLOOKUP(E4803,'[1]Combined AA and BB'!$A$1:$C$6133,3,FALSE)","v":"N"}]
[null,null,null,null,"J0565",39.86,{"$f":"VLOOKUP(E4804,'[1]Combined AA and BB'!$A$1:$C$6133,3,FALSE)","v":"N"}]
[null,null,null,null,"J0567","Not covered","NA"]
[null,null,null,null,"J0570",1336.5,{"$f":"VLOOKUP(E4806,'[1]Combined AA and BB'!$A$1:$C$6133,3,FALSE)","v":"N"}]
[null,null,null,null,"J0583","Not covered","NA"]
[null,null,null,null,"J0584","Not covered","NA"]
[null,null,null,null,"J0585",6.32,{"$f":"VLOOKUP(E4809,'[1]Combined AA and BB'!$A$1:$C$6133,3,FALSE)","v":"N"}]
[null,null,null,null,"J0586",8.6999999999999993,{"$f":"VLOOKUP(E4810,'[1]Combined AA and BB'!$A$1:$C$6133,3,FALSE)","v":"N"}]
[null,null,null,null,"J0587",12.7,{"$f":"VLOOKUP(E4811,'[1]Combined AA and BB'!$A$1:$C$6133,3,FALSE)","v":"N"}]
[null,null,null,null,"J0588",5.2,{"$f":"VLOOKUP(E4812,'[1]Combined AA and BB'!$A$1:$C$6133,3,FALSE)","v":"N"}]
[null,null,null,null,"J0592","Bundled","NA"]
[null,null,null,null,"J0594",1.87,{"$f":"VLOOKUP(E4814,'[1]Combined AA and BB'!$A$1:$C$6133,3,FALSE)","v":"N"}]
[null,null,null,null,"J0595","Bundled","NA"]
[null,null,null,null,"J0596","Not covered","NA"]
[null,null,null,null,"J0597","Not covered","NA"]
[null,null,null,null,"J0599","Not covered","NA"]
[null,null,null,null,"J0600",5708.59,{"$f":"VLOOKUP(E4819,'[1]Combined AA and BB'!$A$1:$C$6133,3,FALSE)","v":"N"}]
[null,null,null,null,"J0606","Bundled","NA"]
[null,null,null,null,"J0620","Not covered","NA"]
[null,null,null,null,"J0630",1328,{"$f":"VLOOKUP(E4822,'[1]Combined AA and BB'!$A$1:$C$6133,3,FALSE)","v":"N"}]
[null,null,null,null,"J0636","Not covered","NA"]
[null,null,null,null,"J0637","Bundled","NA"]
[null,null,null,null,"J0638","Not covered","NA"]
[null,null,null,null,"J0640","Bundled","NA"]
[null,null,null,null,"J0641",1.0900000000000001,{"$f":"VLOOKUP(E4827,'[1]Combined AA and BB'!$A$1:$C$6133,3,FALSE)","v":"N"}]
[null,null,null,null,"J0642","Bundled","NA"]
[null,null,null,null,"J0670","Bundled","NA"]
[null,null,null,null,"J0690","Bundled","NA"]
[null,null,null,null,"J0692","Bundled","NA"]
[null,null,null,null,"J0694","Bundled","NA"]
[null,null,null,null,"J0695",6.71,{"$f":"VLOOKUP(E4833,'[1]Combined AA and BB'!$A$1:$C$6133,3,FALSE)","v":"N"}]
[null,null,null,null,"J0696","Bundled","NA"]
[null,null,null,null,"J0697","Bundled","NA"]
[null,null,null,null,"J0698","Bundled","NA"]
[null,null,null,null,"J0702","Bundled","NA"]
[null,null,null,null,"J0706","Not covered","NA"]
[null,null,null,null,"J0710","Not covered","NA"]
[null,null,null,null,"J0712",3.77,{"$f":"VLOOKUP(E4840,'[1]Combined AA and BB'!$A$1:$C$6133,3,FALSE)","v":"N"}]
[null,null,null,null,"J0713","Bundled","NA"]
[null,null,null,null,"J0714",90.84,{"$f":"VLOOKUP(E4842,'[1]Combined AA and BB'!$A$1:$C$6133,3,FALSE)","v":"N"}]
[null,null,null,null,"J0715","Not covered","NA"]
[null,null,null,null,"J0716",4996.29,{"$f":"VLOOKUP(E4844,'[1]Combined AA and BB'!$A$1:$C$6133,3,FALSE)","v":"N"}]
[null,null,null,null,"J0717","Not covered","NA"]
[null,null,null,null,"J0720","Bundled","NA"]
[null,null,null,null,"J0725","Bundled","NA"]
[null,null,null,null,"J0735","Bundled","NA"]
[null,null,null,null,"J0740",608.33000000000004,{"$f":"VLOOKUP(E4849,'[1]Combined AA and BB'!$A$1:$C$6133,3,FALSE)","v":"N"}]
[null,null,null,null,"J0743","Bundled","NA"]
[null,null,null,null,"J0744","Bundled","NA"]
[null,null,null,null,"J0745","Not covered","NA"]
[null,null,null,null,"J0770","Bundled","NA"]
[null,null,null,null,"J0775","Not covered","NA"]
[null,null,null,null,"J0780","Bundled","NA"]
[null,null,null,null,"J0795","Not covered","NA"]
[null,null,null,null,"J0800",3894.4,{"$f":"VLOOKUP(E4857,'[1]Combined AA and BB'!$A$1:$C$6133,3,FALSE)","v":"N"}]
[null,null,null,null,"J0834","Bundled","NA"]
[null,null,null,null,"J0840",2077.79,{"$f":"VLOOKUP(E4859,'[1]Combined AA and BB'!$A$1:$C$6133,3,FALSE)","v":"N"}]
[null,null,null,null,"J0841","Not covered","NA"]
[null,null,null,null,"J0850",1814.62,{"$f":"VLOOKUP(E4861,'[1]Combined AA and BB'!$A$1:$C$6133,3,FALSE)","v":"N"}]
[null,null,null,null,"J0875",15.32,{"$f":"VLOOKUP(E4862,'[1]Combined AA and BB'!$A$1:$C$6133,3,FALSE)","v":"N"}]
[null,null,null,null,"J0878","Bundled","NA"]
[null,null,null,null,"J0881",3.09,{"$f":"VLOOKUP(E4864,'[1]Combined AA and BB'!$A$1:$C$6133,3,FALSE)","v":"N"}]
[null,null,null,null,"J0883",0.02,{"$f":"VLOOKUP(E4865,'[1]Combined AA and BB'!$A$1:$C$6133,3,FALSE)","v":"N"}]
[null,null,null,null,"J0884",2,{"$f":"VLOOKUP(E4866,'[1]Combined AA and BB'!$A$1:$C$6133,3,FALSE)","v":"N"}]
[null,null,null,null,"J0885",7.93,{"$f":"VLOOKUP(E4867,'[1]Combined AA and BB'!$A$1:$C$6133,3,FALSE)","v":"N"}]
[null,null,null,null,"J0888","Bundled","NA"]
[null,null,null,null,"J0891",0.42,{"$f":"VLOOKUP(E4869,'[1]Combined AA and BB'!$A$1:$C$6133,3,FALSE)","v":"N"}]
[null,null,null,null,"J0892",0.42,{"$f":"VLOOKUP(E4870,'[1]Combined AA and BB'!$A$1:$C$6133,3,FALSE)","v":"N"}]
[null,null,null,null,"J0894","Bundled","NA"]
[null,null,null,null,"J0895","Bundled","NA"]
[null,null,null,null,"J0897",23.02,{"$f":"VLOOKUP(E4873,'[1]Combined AA and BB'!$A$1:$C$6133,3,FALSE)","v":"N"}]
[null,null,null,null,"J0898",2.0299999999999998,{"$f":"VLOOKUP(E4874,'[1]Combined AA and BB'!$A$1:$C$6133,3,FALSE)","v":"N"}]
[null,null,null,null,"J0899",2.0299999999999998,{"$f":"VLOOKUP(E4875,'[1]Combined AA and BB'!$A$1:$C$6133,3,FALSE)","v":"N"}]
[null,null,null,null,"J0945","Not covered","NA"]
[null,null,null,null,"J1000","Not covered","NA"]
[null,null,null,null,"J1020","Bundled","NA"]
[null,null,null,null,"J1030","Bundled","NA"]
[null,null,null,null,"J1040","Bundled","NA"]
[null,null,null,null,"J1050","Bundled","NA"]
[null,null,null,null,"J1071","Bundled","NA"]
[null,null,null,null,"J1094","Not covered","NA"]
[null,null,null,null,"J1100","Bundled","NA"]
[null,null,null,null,"J1110","Bundled","NA"]
[null,null,null,null,"J1120","Bundled","NA"]
[null,null,null,null,"J1160","Bundled","NA"]
[null,null,null,null,"J1162",4593.57,{"$f":"VLOOKUP(E4888,'[1]Combined AA and BB'!$A$1:$C$6133,3,FALSE)","v":"N"}]
[null,null,null,null,"J1165","Bundled","NA"]
[null,null,null,null,"J1170","Bundled","NA"]
[null,null,null,null,"J1180","Not covered","NA"]
[null,null,null,null,"J1190",166.92,{"$f":"VLOOKUP(E4892,'[1]Combined AA and BB'!$A$1:$C$6133,3,FALSE)","v":"N"}]
[null,null,null,null,"J1200","Bundled","NA"]
[null,null,null,null,"J1205","Bundled","NA"]
[null,null,null,null,"J1212",638.70000000000005,{"$f":"VLOOKUP(E4895,'[1]Combined AA and BB'!$A$1:$C$6133,3,FALSE)","v":"N"}]
[null,null,null,null,"J1230","Bundled","NA"]
[null,null,null,null,"J1240","Bundled","NA"]
[null,null,null,null,"J1245","Bundled","NA"]
[null,null,null,null,"J1250","Bundled","NA"]
[null,null,null,null,"J1260","Bundled","NA"]
[null,null,null,null,"J1265","Bundled","NA"]
[null,null,null,null,"J1267","Bundled","NA"]
[null,null,null,null,"J1270","Not covered","NA"]
[null,null,null,null,"J1290","Not covered","NA"]
[null,null,null,null,"J1300","Not covered","NA"]
[null,null,null,null,"J1301","Not covered","NA"]
[null,null,null,null,"J1320","Not covered","NA"]
[null,null,null,null,"J1322","Not covered","NA"]
[null,null,null,null,"J1324","Bundled","NA"]
[null,null,null,null,"J1325","Bundled","NA"]
[null,null,null,null,"J1327","Bundled","NA"]
[null,null,null,null,"J1330","Not covered","NA"]
[null,null,null,null,"J1335","Bundled","NA"]
[null,null,null,null,"J1364",85.54,{"$f":"VLOOKUP(E4914,'[1]Combined AA and BB'!$A$1:$C$6133,3,FALSE)","v":"N"}]
[null,null,null,null,"J1380","Not covered","NA"]
[null,null,null,null,"J1410","Not covered","NA"]
[null,null,null,null,"J1428","Not covered","NA"]
[null,null,null,null,"J1430","Not covered","NA"]
[null,null,null,null,"J1435","Not covered","NA"]
[null,null,null,null,"J1436","Not covered","NA"]
[null,null,null,null,"J1437",21.7,{"$f":"VLOOKUP(E4921,'[1]Combined AA and BB'!$A$1:$C$6133,3,FALSE)","v":"N"}]
[null,null,null,null,"J1438",726.85,{"$f":"VLOOKUP(E4922,'[1]Combined AA and BB'!$A$1:$C$6133,3,FALSE)","v":"N"}]
[null,null,null,null,"J1439",1.1299999999999999,{"$f":"VLOOKUP(E4923,'[1]Combined AA and BB'!$A$1:$C$6133,3,FALSE)","v":"N"}]
[null,null,null,null,"J1442",0.98,{"$f":"VLOOKUP(E4924,'[1]Combined AA and BB'!$A$1:$C$6133,3,FALSE)","v":"N"}]
[null,null,null,null,"J1447",0.39,{"$f":"VLOOKUP(E4925,'[1]Combined AA and BB'!$A$1:$C$6133,3,FALSE)","v":"N"}]
[null,null,null,null,"J1450","Bundled","NA"]
[null,null,null,null,"J1451",9.86,{"$f":"VLOOKUP(E4927,'[1]Combined AA and BB'!$A$1:$C$6133,3,FALSE)","v":"N"}]
[null,null,null,null,"J1453","Bundled","NA"]
[null,null,null,null,"J1454",392.66,{"$f":"VLOOKUP(E4929,'[1]Combined AA and BB'!$A$1:$C$6133,3,FALSE)","v":"N"}]
[null,null,null,null,"J1455",55.49,{"$f":"VLOOKUP(E4930,'[1]Combined AA and BB'!$A$1:$C$6133,3,FALSE)","v":"N"}]
[null,null,null,null,"J1457","Not covered","NA"]
[null,null,null,null,"J1458","Not covered","NA"]
[null,null,null,null,"J1459",47.19,{"$f":"VLOOKUP(E4933,'[1]Combined AA and BB'!$A$1:$C$6133,3,FALSE)","v":"N"}]
[null,null,null,null,"J1460",48.32,{"$f":"VLOOKUP(E4934,'[1]Combined AA and BB'!$A$1:$C$6133,3,FALSE)","v":"N"}]
[null,null,null,null,"J1555",14.91,{"$f":"VLOOKUP(E4935,'[1]Combined AA and BB'!$A$1:$C$6133,3,FALSE)","v":"N"}]
[null,null,null,null,"J1556","Not covered","NA"]
[null,null,null,null,"J1559","Not covered","NA"]
[null,null,null,null,"J1560",483.2,{"$f":"VLOOKUP(E4938,'[1]Combined AA and BB'!$A$1:$C$6133,3,FALSE)","v":"N"}]
[null,null,null,null,"J1561",47.7,{"$f":"VLOOKUP(E4939,'[1]Combined AA and BB'!$A$1:$C$6133,3,FALSE)","v":"N"}]
[null,null,null,null,"J1562","Not covered","NA"]
[null,null,null,null,"J1566",73.17,{"$f":"VLOOKUP(E4941,'[1]Combined AA and BB'!$A$1:$C$6133,3,FALSE)","v":"N"}]
[null,null,null,null,"J1568",41.82,{"$f":"VLOOKUP(E4942,'[1]Combined AA and BB'!$A$1:$C$6133,3,FALSE)","v":"N"}]
[null,null,null,null,"J1569",46.5,{"$f":"VLOOKUP(E4943,'[1]Combined AA and BB'!$A$1:$C$6133,3,FALSE)","v":"N"}]
[null,null,null,null,"J1570","Bundled","NA"]
[null,null,null,null,"J1571",67.34,{"$f":"VLOOKUP(E4945,'[1]Combined AA and BB'!$A$1:$C$6133,3,FALSE)","v":"N"}]
[null,null,null,null,"J1572",44.54,{"$f":"VLOOKUP(E4946,'[1]Combined AA and BB'!$A$1:$C$6133,3,FALSE)","v":"N"}]
[null,null,null,null,"J1573",84.84,{"$f":"VLOOKUP(E4947,'[1]Combined AA and BB'!$A$1:$C$6133,3,FALSE)","v":"N"}]
[null,null,null,null,"J1575","Not covered","NA"]
[null,null,null,null,"J1580","Bundled","NA"]
[null,null,null,null,"J1595","Not covered","NA"]
[null,null,null,null,"J1599","Bundled","NA"]
[null,null,null,null,"J1600","Not covered","NA"]
[null,null,null,null,"J1602",13.85,{"$f":"VLOOKUP(E4953,'[1]Combined AA and BB'!$A$1:$C$6133,3,FALSE)","v":"N"}]
[null,null,null,null,"J1610",190.26,{"$f":"VLOOKUP(E4954,'[1]Combined AA and BB'!$A$1:$C$6133,3,FALSE)","v":"N"}]
[null,null,null,null,"J1611",149.04,{"$f":"VLOOKUP(E4955,'[1]Combined AA and BB'!$A$1:$C$6133,3,FALSE)","v":"N"}]
[null,null,null,null,"J1620","Not covered","NA"]
[null,null,null,null,"J1626","Bundled","NA"]
[null,null,null,null,"J1627",5.9,{"$f":"VLOOKUP(E4958,'[1]Combined AA and BB'!$A$1:$C$6133,3,FALSE)","v":"N"}]
[null,null,null,null,"J1628",119.38,{"$f":"VLOOKUP(E4959,'[1]Combined AA and BB'!$A$1:$C$6133,3,FALSE)","v":"N"}]
[null,null,null,null,"J1630","Bundled","NA"]
[null,null,null,null,"J1631","Bundled","NA"]
[null,null,null,null,"J1632","Bundled","NA"]
[null,null,null,null,"J1640",29.03,{"$f":"VLOOKUP(E4963,'[1]Combined AA and BB'!$A$1:$C$6133,3,FALSE)","v":"N"}]
[null,null,null,null,"J1642","Bundled","NA"]
[null,null,null,null,"J1644","Bundled","NA"]
[null,null,null,null,"J1645","Bundled","NA"]
[null,null,null,null,"J1650","Bundled","NA"]
[null,null,null,null,"J1652","Bundled","NA"]
[null,null,null,null,"J1655","Not covered","NA"]
[null,null,null,null,"J1670",545.62,{"$f":"VLOOKUP(E4970,'[1]Combined AA and BB'!$A$1:$C$6133,3,FALSE)","v":"N"}]
[null,null,null,null,"J1700","Not covered","NA"]
[null,null,null,null,"J1710","Not covered","NA"]
[null,null,null,null,"J1720","Bundled","NA"]
[null,null,null,null,"J1726","Not covered","NA"]
[null,null,null,null,"J1729","Not covered","NA"]
[null,null,null,null,"J1730","Bundled","NA"]
[null,null,null,null,"J1738",3.13,{"$f":"VLOOKUP(E4977,'[1]Combined AA and BB'!$A$1:$C$6133,3,FALSE)","v":"N"}]
[null,null,null,null,"J1740",30.85,{"$f":"VLOOKUP(E4978,'[1]Combined AA and BB'!$A$1:$C$6133,3,FALSE)","v":"N"}]
[null,null,null,null,"J1741","Bundled","NA"]
[null,null,null,null,"J1742",205.06,{"$f":"VLOOKUP(E4980,'[1]Combined AA and BB'!$A$1:$C$6133,3,FALSE)","v":"N"}]
[null,null,null,null,"J1743","Not covered","NA"]
[null,null,null,null,"J1744","Not covered","NA"]
[null,null,null,null,"J1745",34.04,{"$f":"VLOOKUP(E4983,'[1]Combined AA and BB'!$A$1:$C$6133,3,FALSE)","v":"N"}]
[null,null,null,null,"J1746",69.61,{"$f":"VLOOKUP(E4984,'[1]Combined AA and BB'!$A$1:$C$6133,3,FALSE)","v":"N"}]
[null,null,null,null,"J1756","Bundled","NA"]
[null,null,null,null,"J1786",44.33,{"$f":"VLOOKUP(E4986,'[1]Combined AA and BB'!$A$1:$C$6133,3,FALSE)","v":"N"}]
[null,null,null,null,"J1790","Bundled","NA"]
[null,null,null,null,"J1800","Bundled","NA"]
[null,null,null,null,"J1815","Bundled","NA"]
[null,null,null,null,"J1817","Bundled","NA"]
[null,null,null,null,"J1823",462.87,{"$f":"VLOOKUP(E4991,'[1]Combined AA and BB'!$A$1:$C$6133,3,FALSE)","v":"N"}]
[null,null,null,null,"J1830","Bundled","NA"]
[null,null,null,null,"J1833",0.87,{"$f":"VLOOKUP(E4993,'[1]Combined AA and BB'!$A$1:$C$6133,3,FALSE)","v":"N"}]
[null,null,null,null,"J1835","Not covered","NA"]
[null,null,null,null,"J1840","Not covered","NA"]
[null,null,null,null,"J1850","Not covered","NA"]
[null,null,null,null,"J1885","Bundled","NA"]
[null,null,null,null,"J1890","Not covered","NA"]
[null,null,null,null,"J1930","Not covered","NA"]
[null,null,null,null,"J1931",36.049999999999997,{"$f":"VLOOKUP(E5000,'[1]Combined AA and BB'!$A$1:$C$6133,3,FALSE)","v":"N"}]
[null,null,null,null,"J1940","Bundled","NA"]
[null,null,null,null,"J1945","Not covered","NA"]
[null,null,null,null,"J1950",1480.89,{"$f":"VLOOKUP(E5003,'[1]Combined AA and BB'!$A$1:$C$6133,3,FALSE)","v":"N"}]
[null,null,null,null,"J1952","Not covered","NA"]
[null,null,null,null,"J1953","Not covered","NA"]
[null,null,null,null,"J1956","Bundled","NA"]
[null,null,null,null,"J1960","Not covered","NA"]
[null,null,null,null,"J1980","Bundled","NA"]
[null,null,null,null,"J1990","Not covered","NA"]
[null,null,null,null,"J2001","Bundled","NA"]
[null,null,null,null,"J2010","Bundled","NA"]
[null,null,null,null,"J2020","Bundled","NA"]
[null,null,null,null,"J2060","Bundled","NA"]
[null,null,null,null,"J2062","Bundled","NA"]
[null,null,null,null,"J2150","Bundled","NA"]
[null,null,null,null,"J2170","Not covered","NA"]
[null,null,null,null,"J2175","Bundled","NA"]
[null,null,null,null,"J2180","Not covered","NA"]
[null,null,null,null,"J2182",29.37,{"$f":"VLOOKUP(E5019,'[1]Combined AA and BB'!$A$1:$C$6133,3,FALSE)","v":"N"}]
[null,null,null,null,"J2185","Bundled","NA"]
[null,null,null,null,"J2210","Not covered","NA"]
[null,null,null,null,"J2212","Bundled","NA"]
[null,null,null,null,"J2248","Bundled","NA"]
[null,null,null,null,"J2250","Bundled","NA"]
[null,null,null,null,"J2260","Bundled","NA"]
[null,null,null,null,"J2270","Bundled","NA"]
[null,null,null,null,"J2274","Not covered","NA"]
[null,null,null,null,"J2278",9.07,{"$f":"VLOOKUP(E5028,'[1]Combined AA and BB'!$A$1:$C$6133,3,FALSE)","v":"N"}]
[null,null,null,null,"J2280","Bundled","NA"]
[null,null,null,null,"J2300","Bundled","NA"]
[null,null,null,null,"J2310","Bundled","NA"]
[null,null,null,null,"J2315",3.73,{"$f":"VLOOKUP(E5032,'[1]Combined AA and BB'!$A$1:$C$6133,3,FALSE)","v":"N"}]
[null,null,null,null,"J2320","Not covered","NA"]
[null,null,null,null,"J2323","Not covered","NA"]
[null,null,null,null,"J2325","Not covered","NA"]
[null,null,null,null,"J2326","Not covered","NA"]
[null,null,null,null,"J2327","Not covered","NA"]
[null,null,null,null,"J2350","Not covered","NA"]
[null,null,null,null,"J2353",204.54,{"$f":"VLOOKUP(E5039,'[1]Combined AA and BB'!$A$1:$C$6133,3,FALSE)","v":"N"}]
[null,null,null,null,"J2354","Bundled","NA"]
[null,null,null,null,"J2355","Bundled","NA"]
[null,null,null,null,"J2357",37.92,{"$f":"VLOOKUP(E5042,'[1]Combined AA and BB'!$A$1:$C$6133,3,FALSE)","v":"N"}]
[null,null,null,null,"J2358","Bundled","NA"]
[null,null,null,null,"J2360","Bundled","NA"]
[null,null,null,null,"J2370","Bundled","NA"]
[null,null,null,null,"J2405","Bundled","NA"]
[null,null,null,null,"J2407",26.67,{"$f":"VLOOKUP(E5047,'[1]Combined AA and BB'!$A$1:$C$6133,3,FALSE)","v":"N"}]
[null,null,null,null,"J2410","Bundled","NA"]
[null,null,null,null,"J2425","Not covered","NA"]
[null,null,null,null,"J2426",13.65,{"$f":"VLOOKUP(E5050,'[1]Combined AA and BB'!$A$1:$C$6133,3,FALSE)","v":"N"}]
[null,null,null,null,"J2430","Bundled","NA"]
[null,null,null,null,"J2440","Bundled","NA"]
[null,null,null,null,"J2469","Bundled","NA"]
[null,null,null,null,"J2501","Bundled","NA"]
[null,null,null,null,"J2502",695.36,{"$f":"VLOOKUP(E5055,'[1]Combined AA and BB'!$A$1:$C$6133,3,FALSE)","v":"N"}]
[null,null,null,null,"J2503","Not covered","NA"]
[null,null,null,null,"J2504","Not covered","NA"]
[null,null,null,null,"J2506","by report",{"$f":"VLOOKUP(E5058,'[1]Combined AA and BB'!$A$1:$C$6133,3,FALSE)","v":"N"}]
[null,null,null,null,"J2510",39.340000000000003,{"$f":"VLOOKUP(E5059,'[1]Combined AA and BB'!$A$1:$C$6133,3,FALSE)","v":"N"}]
[null,null,null,null,"J2513","Bundled","NA"]
[null,null,null,null,"J2515","Not covered","NA"]
[null,null,null,null,"J2540","Bundled","NA"]
[null,null,null,null,"J2543","Bundled","NA"]
[null,null,null,null,"J2547",1.58,{"$f":"VLOOKUP(E5064,'[1]Combined AA and BB'!$A$1:$C$6133,3,FALSE)","v":"N"}]
[null,null,null,null,"J2550","Bundled","NA"]
[null,null,null,null,"J2560",39.03,{"$f":"VLOOKUP(E5066,'[1]Combined AA and BB'!$A$1:$C$6133,3,FALSE)","v":"N"}]
[null,null,null,null,"J2562",401.58,{"$f":"VLOOKUP(E5067,'[1]Combined AA and BB'!$A$1:$C$6133,3,FALSE)","v":"N"}]
[null,null,null,null,"J2590","Not covered","NA"]
[null,null,null,null,"J2597",7.08,{"$f":"VLOOKUP(E5069,'[1]Combined AA and BB'!$A$1:$C$6133,3,FALSE)","v":"N"}]
[null,null,null,null,"J2650","Not covered","NA"]
[null,null,null,null,"J2670","Not covered","NA"]
[null,null,null,null,"J2675","Not covered","NA"]
[null,null,null,null,"J2680","Bundled","NA"]
[null,null,null,null,"J2690","Bundled","NA"]
[null,null,null,null,"J2700","Bundled","NA"]
[null,null,null,null,"J2704","Bundled","NA"]
[null,null,null,null,"J2710","Bundled","NA"]
[null,null,null,null,"J2720","Bundled","NA"]
[null,null,null,null,"J2724",15.09,{"$f":"VLOOKUP(E5079,'[1]Combined AA and BB'!$A$1:$C$6133,3,FALSE)","v":"N"}]
[null,null,null,null,"J2725","Not covered","NA"]
[null,null,null,null,"J2730","Bundled","NA"]
[null,null,null,null,"J2760",452.42,{"$f":"VLOOKUP(E5082,'[1]Combined AA and BB'!$A$1:$C$6133,3,FALSE)","v":"N"}]
[null,null,null,null,"J2765","Not covered","NA"]
[null,null,null,null,"J2770",428.32799999999997,{"$f":"VLOOKUP(E5084,'[1]Combined AA and BB'!$A$1:$C$6133,3,FALSE)","v":"N"}]
[null,null,null,null,"J2778","Not covered","NA"]
[null,null,null,null,"J2780","Bundled","NA"]
[null,null,null,null,"J2783","Not covered","NA"]
[null,null,null,null,"J2785","Bundled","NA"]
[null,null,null,null,"J2786",10.16,{"$f":"VLOOKUP(E5089,'[1]Combined AA and BB'!$A$1:$C$6133,3,FALSE)","v":"N"}]
[null,null,null,null,"J2788","Bundled","NA"]
[null,null,null,null,"J2790","Bundled","NA"]
[null,null,null,null,"J2791","Bundled","NA"]
[null,null,null,null,"J2792",34.22,{"$f":"VLOOKUP(E5093,'[1]Combined AA and BB'!$A$1:$C$6133,3,FALSE)","v":"N"}]
[null,null,null,null,"J2794",11.59,{"$f":"VLOOKUP(E5094,'[1]Combined AA and BB'!$A$1:$C$6133,3,FALSE)","v":"N"}]
[null,null,null,null,"J2795","Bundled","NA"]
[null,null,null,null,"J2796",90.61,{"$f":"VLOOKUP(E5096,'[1]Combined AA and BB'!$A$1:$C$6133,3,FALSE)","v":"N"}]
[null,null,null,null,"J2797","Not covered","NA"]
[null,null,null,null,"J2800","Bundled","NA"]
[null,null,null,null,"J2805","Not covered","NA"]
[null,null,null,null,"J2810","Bundled","NA"]
[null,null,null,null,"J2820",57.08,{"$f":"VLOOKUP(E5101,'[1]Combined AA and BB'!$A$1:$C$6133,3,FALSE)","v":"N"}]
[null,null,null,null,"J2840","Not covered","NA"]
[null,null,null,null,"J2850","Not covered","NA"]
[null,null,null,null,"J2860","Not covered","NA"]
[null,null,null,null,"J2910","Not covered","NA"]
[null,null,null,null,"J2916","Bundled","NA"]
[null,null,null,null,"J2920","Bundled","NA"]
[null,null,null,null,"J2930","Bundled","NA"]
[null,null,null,null,"J2941","Not covered","NA"]
[null,null,null,null,"J2950","Not covered","NA"]
[null,null,null,null,"J2993","Not covered","NA"]
[null,null,null,null,"J2995","Not covered","NA"]
[null,null,null,null,"J2997",87.57,{"$f":"VLOOKUP(E5113,'[1]Combined AA and BB'!$A$1:$C$6133,3,FALSE)","v":"N"}]
[null,null,null,null,"J3000","Bundled","NA"]
[null,null,null,null,"J3010","Bundled","NA"]
[null,null,null,null,"J3030","Bundled","NA"]
[null,null,null,null,"J3032",17.010000000000002,{"$f":"VLOOKUP(E5117,'[1]Combined AA and BB'!$A$1:$C$6133,3,FALSE)","v":"N"}]
[null,null,null,null,"J3060","Not covered","NA"]
[null,null,null,null,"J3070","Bundled","NA"]
[null,null,null,null,"J3090",1.66,{"$f":"VLOOKUP(E5120,'[1]Combined AA and BB'!$A$1:$C$6133,3,FALSE)","v":"N"}]
[null,null,null,null,"J3095",6.95,{"$f":"VLOOKUP(E5121,'[1]Combined AA and BB'!$A$1:$C$6133,3,FALSE)","v":"N"}]
[null,null,null,null,"J3101",143.69,{"$f":"VLOOKUP(E5122,'[1]Combined AA and BB'!$A$1:$C$6133,3,FALSE)","v":"N"}]
[null,null,null,null,"J3105","Bundled","NA"]
[null,null,null,null,"J3121","Bundled","NA"]
[null,null,null,null,"J3145",1.85,{"$f":"VLOOKUP(E5125,'[1]Combined AA and BB'!$A$1:$C$6133,3,FALSE)","v":"N"}]
[null,null,null,null,"J3230","Bundled","NA"]
[null,null,null,null,"J3240",1926.74,{"$f":"VLOOKUP(E5127,'[1]Combined AA and BB'!$A$1:$C$6133,3,FALSE)","v":"N"}]
[null,null,null,null,"J3241",328,{"$f":"VLOOKUP(E5128,'[1]Combined AA and BB'!$A$1:$C$6133,3,FALSE)","v":"N"}]
[null,null,null,null,"J3243","Bundled","NA"]
[null,null,null,null,"J3246","Bundled","NA"]
[null,null,null,null,"J3250","Bundled","NA"]
[null,null,null,null,"J3260","Bundled","NA"]
[null,null,null,null,"J3262",5.86,{"$f":"VLOOKUP(E5133,'[1]Combined AA and BB'!$A$1:$C$6133,3,FALSE)","v":"N"}]
[null,null,null,null,"J3265","Bundled","NA"]
[null,null,null,null,"J3280","Not covered","NA"]
[null,null,null,null,"J3285","Not covered","NA"]
[null,null,null,null,"J3300","Bundled","NA"]
[null,null,null,null,"J3301","Bundled","NA"]
[null,null,null,null,"J3302","Not covered","NA"]
[null,null,null,null,"J3303","Bundled","NA"]
[null,null,null,null,"J3304",16.86,{"$f":"VLOOKUP(E5141,'[1]Combined AA and BB'!$A$1:$C$6133,3,FALSE)","v":"N"}]
[null,null,null,null,"J3310","Not covered","NA"]
[null,null,null,null,"J3315","Not covered","NA"]
[null,null,null,null,"J3316","Not covered","NA"]
[null,null,null,null,"J3320","Not covered","NA"]
[null,null,null,null,"J3350","Not covered","NA"]
[null,null,null,null,"J3355","Not covered","NA"]
[null,null,null,null,"J3357",153.77000000000001,{"$f":"VLOOKUP(E5148,'[1]Combined AA and BB'!$A$1:$C$6133,3,FALSE)","v":"N"}]
[null,null,null,null,"J3358",12.25,{"$f":"VLOOKUP(E5149,'[1]Combined AA and BB'!$A$1:$C$6133,3,FALSE)","v":"N"}]
[null,null,null,null,"J3360","Bundled","NA"]
[null,null,null,null,"J3364","Not covered","NA"]
[null,null,null,null,"J3365","Not covered","NA"]
[null,null,null,null,"J3370","Bundled","NA"]
[null,null,null,null,"J3380",21.84,{"$f":"VLOOKUP(E5154,'[1]Combined AA and BB'!$A$1:$C$6133,3,FALSE)","v":"N"}]
[null,null,null,null,"J3385","Not covered","NA"]
[null,null,null,null,"J3396","Not covered","NA"]
[null,null,null,null,"J3397","Not covered","NA"]
[null,null,null,null,"J3398","Not covered","NA"]
[null,null,null,null,"J3400","Not covered","NA"]
[null,null,null,null,"J3410","Bundled","NA"]
[null,null,null,null,"J3411","Bundled","NA"]
[null,null,null,null,"J3415","Bundled","NA"]
[null,null,null,null,"J3420","Bundled","NA"]
[null,null,null,null,"J3430","Bundled","NA"]
[null,null,null,null,"J3465","Bundled","NA"]
[null,null,null,null,"J3470","Bundled","NA"]
[null,null,null,null,"J3471","Bundled","NA"]
[null,null,null,null,"J3472","Bundled","NA"]
[null,null,null,null,"J3473","Bundled","NA"]
[null,null,null,null,"J3475","Bundled","NA"]
[null,null,null,null,"J3480","Bundled","NA"]
[null,null,null,null,"J3485","Bundled","NA"]
[null,null,null,null,"J3486","Bundled","NA"]
[null,null,null,null,"J3489","Bundled","NA"]
[null,null,null,null,"J3490","Bundled","NA"]
[null,null,null,null,"J3530","Not covered","NA"]
[null,null,null,null,"J3590","Bundled","NA"]
[null,null,null,null,"J7030","Bundled","NA"]
[null,null,null,null,"J7040","Bundled","NA"]
[null,null,null,null,"J7042","Bundled","NA"]
[null,null,null,null,"J7050","Bundled","NA"]
[null,null,null,null,"J7060","Bundled","NA"]
[null,null,null,null,"J7070","Bundled","NA"]
[null,null,null,null,"J7100","Bundled","NA"]
[null,null,null,null,"J7110","Not covered","NA"]
[null,null,null,null,"J7120","Bundled","NA"]
[null,null,null,null,"J7131","Bundled","NA"]
[null,null,null,null,"J7170","Not covered","NA"]
[null,null,null,null,"J7175",8.61,{"$f":"VLOOKUP(E5189,'[1]Combined AA and BB'!$A$1:$C$6133,3,FALSE)","v":"N"}]
[null,null,null,null,"J7177","Not covered","NA"]
[null,null,null,null,"J7178",1.38,{"$f":"VLOOKUP(E5191,'[1]Combined AA and BB'!$A$1:$C$6133,3,FALSE)","v":"N"}]
[null,null,null,null,"J7179",1.87,{"$f":"VLOOKUP(E5192,'[1]Combined AA and BB'!$A$1:$C$6133,3,FALSE)","v":"N"}]
[null,null,null,null,"J7181","Bundled","NA"]
[null,null,null,null,"J7185",1.3,{"$f":"VLOOKUP(E5194,'[1]Combined AA and BB'!$A$1:$C$6133,3,FALSE)","v":"N"}]
[null,null,null,null,"J7186",1.17,{"$f":"VLOOKUP(E5195,'[1]Combined AA and BB'!$A$1:$C$6133,3,FALSE)","v":"N"}]
[null,null,null,null,"J7187",1.35,{"$f":"VLOOKUP(E5196,'[1]Combined AA and BB'!$A$1:$C$6133,3,FALSE)","v":"N"}]
[null,null,null,null,"J7188",3.22,{"$f":"VLOOKUP(E5197,'[1]Combined AA and BB'!$A$1:$C$6133,3,FALSE)","v":"N"}]
[null,null,null,null,"J7189",2.34,{"$f":"VLOOKUP(E5198,'[1]Combined AA and BB'!$A$1:$C$6133,3,FALSE)","v":"N"}]
[null,null,null,null,"J7190",1.1299999999999999,{"$f":"VLOOKUP(E5199,'[1]Combined AA and BB'!$A$1:$C$6133,3,FALSE)","v":"N"}]
[null,null,null,null,"J7191","Bundled","NA"]
[null,null,null,null,"J7192",1.45,{"$f":"VLOOKUP(E5201,'[1]Combined AA and BB'!$A$1:$C$6133,3,FALSE)","v":"N"}]
[null,null,null,null,"J7193",1.23,{"$f":"VLOOKUP(E5202,'[1]Combined AA and BB'!$A$1:$C$6133,3,FALSE)","v":"N"}]
[null,null,null,null,"J7194",1.58,{"$f":"VLOOKUP(E5203,'[1]Combined AA and BB'!$A$1:$C$6133,3,FALSE)","v":"N"}]
[null,null,null,null,"J7195",1.65,{"$f":"VLOOKUP(E5204,'[1]Combined AA and BB'!$A$1:$C$6133,3,FALSE)","v":"N"}]
[null,null,null,null,"J7196","Bundled","NA"]
[null,null,null,null,"J7197",3.72,{"$f":"VLOOKUP(E5206,'[1]Combined AA and BB'!$A$1:$C$6133,3,FALSE)","v":"N"}]
[null,null,null,null,"J7198",2.2400000000000002,{"$f":"VLOOKUP(E5207,'[1]Combined AA and BB'!$A$1:$C$6133,3,FALSE)","v":"N"}]
[null,null,null,null,"J7200",1.57,{"$f":"VLOOKUP(E5208,'[1]Combined AA and BB'!$A$1:$C$6133,3,FALSE)","v":"N"}]
[null,null,null,null,"J7201",3.37,{"$f":"VLOOKUP(E5209,'[1]Combined AA and BB'!$A$1:$C$6133,3,FALSE)","v":"N"}]
[null,null,null,null,"J7202",4.95,{"$f":"VLOOKUP(E5210,'[1]Combined AA and BB'!$A$1:$C$6133,3,FALSE)","v":"N"}]
[null,null,null,null,"J7203","Not covered","NA"]
[null,null,null,null,"J7205",2.1800000000000002,{"$f":"VLOOKUP(E5212,'[1]Combined AA and BB'!$A$1:$C$6133,3,FALSE)","v":"N"}]
[null,null,null,null,"J7207",1.93,{"$f":"VLOOKUP(E5213,'[1]Combined AA and BB'!$A$1:$C$6133,3,FALSE)","v":"N"}]
[null,null,null,null,"J7209",1.35,{"$f":"VLOOKUP(E5214,'[1]Combined AA and BB'!$A$1:$C$6133,3,FALSE)","v":"N"}]
[null,null,null,null,"J7210",1.44,{"$f":"VLOOKUP(E5215,'[1]Combined AA and BB'!$A$1:$C$6133,3,FALSE)","v":"N"}]
[null,null,null,null,"J7211",1.34,{"$f":"VLOOKUP(E5216,'[1]Combined AA and BB'!$A$1:$C$6133,3,FALSE)","v":"N"}]
[null,null,null,null,"J7212",1.91,{"$f":"VLOOKUP(E5217,'[1]Combined AA and BB'!$A$1:$C$6133,3,FALSE)","v":"N"}]
[null,null,null,null,"J7308","Not covered","NA"]
[null,null,null,null,"J7309","Not covered","NA"]
[null,null,null,null,"J7310","Not covered","NA"]
[null,null,null,null,"J7311",337.68,{"$f":"VLOOKUP(E5221,'[1]Combined AA and BB'!$A$1:$C$6133,3,FALSE)","v":"N"}]
[null,null,null,null,"J7312",199.84,{"$f":"VLOOKUP(E5222,'[1]Combined AA and BB'!$A$1:$C$6133,3,FALSE)","v":"N"}]
[null,null,null,null,"J7313",490.95,{"$f":"VLOOKUP(E5223,'[1]Combined AA and BB'!$A$1:$C$6133,3,FALSE)","v":"N"}]
[null,null,null,null,"J7315","Bundled","NA"]
[null,null,null,null,"J7316","Not covered","NA"]
[null,null,null,null,"J7318",6.77,{"$f":"VLOOKUP(E5226,'[1]Combined AA and BB'!$A$1:$C$6133,3,FALSE)","v":"N"}]
[null,null,null,null,"J7321","Bundled","NA"]
[null,null,null,null,"J7322",16.66,{"$f":"VLOOKUP(E5228,'[1]Combined AA and BB'!$A$1:$C$6133,3,FALSE)","v":"N"}]
[null,null,null,null,"J7323",129.47,{"$f":"VLOOKUP(E5229,'[1]Combined AA and BB'!$A$1:$C$6133,3,FALSE)","v":"N"}]
[null,null,null,null,"J7324",134.46,{"$f":"VLOOKUP(E5230,'[1]Combined AA and BB'!$A$1:$C$6133,3,FALSE)","v":"N"}]
[null,null,null,null,"J7325",9.65,{"$f":"VLOOKUP(E5231,'[1]Combined AA and BB'!$A$1:$C$6133,3,FALSE)","v":"N"}]
[null,null,null,null,"J7326",522.47,{"$f":"VLOOKUP(E5232,'[1]Combined AA and BB'!$A$1:$C$6133,3,FALSE)","v":"N"}]
[null,null,null,null,"J7327",719.33,{"$f":"VLOOKUP(E5233,'[1]Combined AA and BB'!$A$1:$C$6133,3,FALSE)","v":"N"}]
[null,null,null,null,"J7336",3.28,{"$f":"VLOOKUP(E5234,'[1]Combined AA and BB'!$A$1:$C$6133,3,FALSE)","v":"N"}]
[null,null,null,null,"J7340",219.76,{"$f":"VLOOKUP(E5235,'[1]Combined AA and BB'!$A$1:$C$6133,3,FALSE)","v":"N"}]
[null,null,null,null,"J7342","Not covered","NA"]
[null,null,null,null,"J7345","Not covered","NA"]
[null,null,null,null,"J7351",206.28,{"$f":"VLOOKUP(E5238,'[1]Combined AA and BB'!$A$1:$C$6133,3,FALSE)","v":"N"}]
[null,null,null,null,"J7352","by report",{"$f":"VLOOKUP(E5239,'[1]Combined AA and BB'!$A$1:$C$6133,3,FALSE)","v":"N"}]
[null,null,null,null,"J7500","Bundled","NA"]
[null,null,null,null,"J7501","Not covered","NA"]
[null,null,null,null,"J7502","Bundled","NA"]
[null,null,null,null,"J7504",3001.29,{"$f":"VLOOKUP(E5243,'[1]Combined AA and BB'!$A$1:$C$6133,3,FALSE)","v":"N"}]
[null,null,null,null,"J7505","Not covered","NA"]
[null,null,null,null,"J7507","Bundled","NA"]
[null,null,null,null,"J7508","Bundled","NA"]
[null,null,null,null,"J7509","Bundled","NA"]
[null,null,null,null,"J7510","Bundled","NA"]
[null,null,null,null,"J7511",886.38,{"$f":"VLOOKUP(E5249,'[1]Combined AA and BB'!$A$1:$C$6133,3,FALSE)","v":"N"}]
[null,null,null,null,"J7513","Not covered","NA"]
[null,null,null,null,"J7515","Bundled","NA"]
[null,null,null,null,"J7516","Bundled","NA"]
[null,null,null,null,"J7517","Bundled","NA"]
[null,null,null,null,"J7518","Not covered","NA"]
[null,null,null,null,"J7520","Bundled","NA"]
[null,null,null,null,"J7525",233.92,{"$f":"VLOOKUP(E5256,'[1]Combined AA and BB'!$A$1:$C$6133,3,FALSE)","v":"N"}]
[null,null,null,null,"J7527","Bundled","NA"]
[null,null,null,null,"J7599","Bundled","NA"]
[null,null,null,null,"J7674","Bundled","NA"]
[null,null,null,null,"J7799","Bundled","NA"]
[null,null,null,null,"J8501","Not covered","NA"]
[null,null,null,null,"J8510","Bundled","NA"]
[null,null,null,null,"J8520","Bundled","NA"]
[null,null,null,null,"J8521","Bundled","NA"]
[null,null,null,null,"J8530","Bundled","NA"]
[null,null,null,null,"J8540","Bundled","NA"]
[null,null,null,null,"J8560",76.56,{"$f":"VLOOKUP(E5267,'[1]Combined AA and BB'!$A$1:$C$6133,3,FALSE)","v":"N"}]
[null,null,null,null,"J8562","Not covered","NA"]
[null,null,null,null,"J8597","Bundled","NA"]
[null,null,null,null,"J8600","Bundled","NA"]
[null,null,null,null,"J8610","Bundled","NA"]
[null,null,null,null,"J8655",442.11,{"$f":"VLOOKUP(E5272,'[1]Combined AA and BB'!$A$1:$C$6133,3,FALSE)","v":"N"}]
[null,null,null,null,"J8670",1.8,{"$f":"VLOOKUP(E5273,'[1]Combined AA and BB'!$A$1:$C$6133,3,FALSE)","v":"N"}]
[null,null,null,null,"J8700","Bundled","NA"]
[null,null,null,null,"J8705","Bundled","NA"]
[null,null,null,null,"J9000","Bundled","NA"]
[null,null,null,null,"J9015",4683.6000000000004,{"$f":"VLOOKUP(E5277,'[1]Combined AA and BB'!$A$1:$C$6133,3,FALSE)","v":"N"}]
[null,null,null,null,"J9017",13.7,{"$f":"VLOOKUP(E5278,'[1]Combined AA and BB'!$A$1:$C$6133,3,FALSE)","v":"N"}]
[null,null,null,null,"J9019",427.26900000000001,{"$f":"VLOOKUP(E5279,'[1]Combined AA and BB'!$A$1:$C$6133,3,FALSE)","v":"N"}]
[null,null,null,null,"J9020","Not covered","NA"]
[null,null,null,null,"J9021",48.23,{"$f":"VLOOKUP(E5281,'[1]Combined AA and BB'!$A$1:$C$6133,3,FALSE)","v":"N"}]
[null,null,null,null,"J9022",81.06,{"$f":"VLOOKUP(E5282,'[1]Combined AA and BB'!$A$1:$C$6133,3,FALSE)","v":"N"}]
[null,null,null,null,"J9023","Not covered","NA"]
[null,null,null,null,"J9025","Not covered","NA"]
[null,null,null,null,"J9027","Not covered","NA"]
[null,null,null,null,"J9032",47.12,{"$f":"VLOOKUP(E5286,'[1]Combined AA and BB'!$A$1:$C$6133,3,FALSE)","v":"N"}]
[null,null,null,null,"J9033",14.37,{"$f":"VLOOKUP(E5287,'[1]Combined AA and BB'!$A$1:$C$6133,3,FALSE)","v":"N"}]
[null,null,null,null,"J9034",16.91,{"$f":"VLOOKUP(E5288,'[1]Combined AA and BB'!$A$1:$C$6133,3,FALSE)","v":"N"}]
[null,null,null,null,"J9035",71.349999999999994,{"$f":"VLOOKUP(E5289,'[1]Combined AA and BB'!$A$1:$C$6133,3,FALSE)","v":"N"}]
[null,null,null,null,"J9039",136.07,{"$f":"VLOOKUP(E5290,'[1]Combined AA and BB'!$A$1:$C$6133,3,FALSE)","v":"N"}]
[null,null,null,null,"J9040","Bundled","NA"]
[null,null,null,null,"J9041",6.22,{"$f":"VLOOKUP(E5292,'[1]Combined AA and BB'!$A$1:$C$6133,3,FALSE)","v":"N"}]
[null,null,null,null,"J9042","Not covered","NA"]
[null,null,null,null,"J9045","Bundled","NA"]
[null,null,null,null,"J9046",8.65,{"$f":"VLOOKUP(E5295,'[1]Combined AA and BB'!$A$1:$C$6133,3,FALSE)","v":"N"}]
[null,null,null,null,"J9047",44.76,{"$f":"VLOOKUP(E5296,'[1]Combined AA and BB'!$A$1:$C$6133,3,FALSE)","v":"N"}]
[null,null,null,null,"J9048",2.68,{"$f":"VLOOKUP(E5297,'[1]Combined AA and BB'!$A$1:$C$6133,3,FALSE)","v":"N"}]
[null,null,null,null,"J9049",5.67,{"$f":"VLOOKUP(E5298,'[1]Combined AA and BB'!$A$1:$C$6133,3,FALSE)","v":"N"}]
[null,null,null,null,"J9050",304.62,{"$f":"VLOOKUP(E5299,'[1]Combined AA and BB'!$A$1:$C$6133,3,FALSE)","v":"N"}]
[null,null,null,null,"J9055","Not covered","NA"]
[null,null,null,null,"J9057","Not covered","NA"]
[null,null,null,null,"J9060","Bundled","NA"]
[null,null,null,null,"J9061",19.68,{"$f":"VLOOKUP(E5303,'[1]Combined AA and BB'!$A$1:$C$6133,3,FALSE)","v":"N"}]
[null,null,null,null,"J9065",18.88,{"$f":"VLOOKUP(E5304,'[1]Combined AA and BB'!$A$1:$C$6133,3,FALSE)","v":"N"}]
[null,null,null,null,"J9070","Not covered","NA"]
[null,null,null,null,"J9098","Bundled","NA"]
[null,null,null,null,"J9100","Bundled","NA"]
[null,null,null,null,"J9120",546.61,{"$f":"VLOOKUP(E5308,'[1]Combined AA and BB'!$A$1:$C$6133,3,FALSE)","v":"N"}]
[null,null,null,null,"J9130","Bundled","NA"]
[null,null,null,null,"J9144",48.21,{"$f":"VLOOKUP(E5310,'[1]Combined AA and BB'!$A$1:$C$6133,3,FALSE)","v":"N"}]
[null,null,null,null,"J9145",60.77,{"$f":"VLOOKUP(E5311,'[1]Combined AA and BB'!$A$1:$C$6133,3,FALSE)","v":"N"}]
[null,null,null,null,"J9150",37.159999999999997,{"$f":"VLOOKUP(E5312,'[1]Combined AA and BB'!$A$1:$C$6133,3,FALSE)","v":"N"}]
[null,null,null,null,"J9151","Bundled","NA"]
[null,null,null,null,"J9153","Not covered","NA"]
[null,null,null,null,"J9160","Not covered","NA"]
[null,null,null,null,"J9171","Bundled","NA"]
[null,null,null,null,"J9173","Not covered","NA"]
[null,null,null,null,"J9175","Not covered","NA"]
[null,null,null,null,"J9176",7.06,{"$f":"VLOOKUP(E5319,'[1]Combined AA and BB'!$A$1:$C$6133,3,FALSE)","v":"N"}]
[null,null,null,null,"J9178","Bundled","NA"]
[null,null,null,null,"J9179",126.92,{"$f":"VLOOKUP(E5321,'[1]Combined AA and BB'!$A$1:$C$6133,3,FALSE)","v":"N"}]
[null,null,null,null,"J9181","Bundled","NA"]
[null,null,null,null,"J9185",161.75,{"$f":"VLOOKUP(E5323,'[1]Combined AA and BB'!$A$1:$C$6133,3,FALSE)","v":"N"}]
[null,null,null,null,"J9190","Bundled","NA"]
[null,null,null,null,"J9200","Bundled","NA"]
[null,null,null,null,"J9201","Bundled","NA"]
[null,null,null,null,"J9202",561.59,{"$f":"VLOOKUP(E5327,'[1]Combined AA and BB'!$A$1:$C$6133,3,FALSE)","v":"N"}]
[null,null,null,null,"J9203",217.49,{"$f":"VLOOKUP(E5328,'[1]Combined AA and BB'!$A$1:$C$6133,3,FALSE)","v":"N"}]
[null,null,null,null,"J9205",59.95,{"$f":"VLOOKUP(E5329,'[1]Combined AA and BB'!$A$1:$C$6133,3,FALSE)","v":"N"}]
[null,null,null,null,"J9206","Bundled","NA"]
[null,null,null,null,"J9207",121.88,{"$f":"VLOOKUP(E5331,'[1]Combined AA and BB'!$A$1:$C$6133,3,FALSE)","v":"N"}]
[null,null,null,null,"J9208","Bundled","NA"]
[null,null,null,null,"J9209","Bundled","NA"]
[null,null,null,null,"J9211","Bundled","NA"]
[null,null,null,null,"J9212","Bundled","NA"]
[null,null,null,null,"J9213","Not covered","NA"]
[null,null,null,null,"J9214",32.57,{"$f":"VLOOKUP(E5337,'[1]Combined AA and BB'!$A$1:$C$6133,3,FALSE)","v":"N"}]
[null,null,null,null,"J9215","Bundled","NA"]
[null,null,null,null,"J9216","Bundled","NA"]
[null,null,null,null,"J9217",172.56,{"$f":"VLOOKUP(E5340,'[1]Combined AA and BB'!$A$1:$C$6133,3,FALSE)","v":"N"}]
[null,null,null,null,"J9218",8.01,{"$f":"VLOOKUP(E5341,'[1]Combined AA and BB'!$A$1:$C$6133,3,FALSE)","v":"N"}]
[null,null,null,null,"J9219","Not covered","NA"]
[null,null,null,null,"J9223",188.3,{"$f":"VLOOKUP(E5343,'[1]Combined AA and BB'!$A$1:$C$6133,3,FALSE)","v":"N"}]
[null,null,null,null,"J9225","Not covered","NA"]
[null,null,null,null,"J9226","Not covered","NA"]
[null,null,null,null,"J9227",71.7,{"$f":"VLOOKUP(E5346,'[1]Combined AA and BB'!$A$1:$C$6133,3,FALSE)","v":"N"}]
[null,null,null,null,"J9229","Not covered","NA"]
[null,null,null,null,"J9230","Bundled","NA"]
[null,null,null,null,"J9245",186.51,{"$f":"VLOOKUP(E5349,'[1]Combined AA and BB'!$A$1:$C$6133,3,FALSE)","v":"N"}]
[null,null,null,null,"J9250","Bundled","NA"]
[null,null,null,null,"J9260","Bundled","NA"]
[null,null,null,null,"J9261",129.84,{"$f":"VLOOKUP(E5352,'[1]Combined AA and BB'!$A$1:$C$6133,3,FALSE)","v":"N"}]
[null,null,null,null,"J9262","Not covered","NA"]
[null,null,null,null,"J9263","Bundled","NA"]
[null,null,null,null,"J9264",11.78,{"$f":"VLOOKUP(E5355,'[1]Combined AA and BB'!$A$1:$C$6133,3,FALSE)","v":"N"}]
[null,null,null,null,"J9266",23577.01,{"$f":"VLOOKUP(E5356,'[1]Combined AA and BB'!$A$1:$C$6133,3,FALSE)","v":"N"}]
[null,null,null,null,"J9267","Bundled","NA"]
[null,null,null,null,"J9268",2585.41,{"$f":"VLOOKUP(E5358,'[1]Combined AA and BB'!$A$1:$C$6133,3,FALSE)","v":"N"}]
[null,null,null,null,"J9270","Not covered","NA"]
[null,null,null,null,"J9271",55.42,{"$f":"VLOOKUP(E5360,'[1]Combined AA and BB'!$A$1:$C$6133,3,FALSE)","v":"N"}]
[null,null,null,null,"J9272","Not covered","NA"]
[null,null,null,null,"J9280",24.02,{"$f":"VLOOKUP(E5362,'[1]Combined AA and BB'!$A$1:$C$6133,3,FALSE)","v":"N"}]
[null,null,null,null,"J9281",289.51,{"$f":"VLOOKUP(E5363,'[1]Combined AA and BB'!$A$1:$C$6133,3,FALSE)","v":"N"}]
[null,null,null,null,"J9285","Not covered","NA"]
[null,null,null,null,"J9293",49.33,{"$f":"VLOOKUP(E5365,'[1]Combined AA and BB'!$A$1:$C$6133,3,FALSE)","v":"N"}]
[null,null,null,null,"J9295",5.74,{"$f":"VLOOKUP(E5366,'[1]Combined AA and BB'!$A$1:$C$6133,3,FALSE)","v":"N"}]
[null,null,null,null,"J9299","Not covered","NA"]
[null,null,null,null,"J9301","Not covered","NA"]
[null,null,null,null,"J9302",63.957000000000001,{"$f":"VLOOKUP(E5369,'[1]Combined AA and BB'!$A$1:$C$6133,3,FALSE)","v":"N"}]
[null,null,null,null,"J9303","Not covered","NA"]
[null,null,null,null,"J9304",77.55,{"$f":"VLOOKUP(E5371,'[1]Combined AA and BB'!$A$1:$C$6133,3,FALSE)","v":"N"}]
[null,null,null,null,"J9305",17.14,{"$f":"VLOOKUP(E5372,'[1]Combined AA and BB'!$A$1:$C$6133,3,FALSE)","v":"N"}]
[null,null,null,null,"J9306",14.43,{"$f":"VLOOKUP(E5373,'[1]Combined AA and BB'!$A$1:$C$6133,3,FALSE)","v":"N"}]
[null,null,null,null,"J9307",351.95,{"$f":"VLOOKUP(E5374,'[1]Combined AA and BB'!$A$1:$C$6133,3,FALSE)","v":"N"}]
[null,null,null,null,"J9308",66.849999999999994,{"$f":"VLOOKUP(E5375,'[1]Combined AA and BB'!$A$1:$C$6133,3,FALSE)","v":"N"}]
[null,null,null,null,"J9309",118.11,{"$f":"VLOOKUP(E5376,'[1]Combined AA and BB'!$A$1:$C$6133,3,FALSE)","v":"N"}]
[null,null,null,null,"J9311","Not covered","NA"]
[null,null,null,null,"J9312",81.19,{"$f":"VLOOKUP(E5378,'[1]Combined AA and BB'!$A$1:$C$6133,3,FALSE)","v":"N"}]
[null,null,null,null,"J9316",68.44,{"$f":"VLOOKUP(E5379,'[1]Combined AA and BB'!$A$1:$C$6133,3,FALSE)","v":"N"}]
[null,null,null,null,"J9317",32.549999999999997,{"$f":"VLOOKUP(E5380,'[1]Combined AA and BB'!$A$1:$C$6133,3,FALSE)","v":"N"}]
[null,null,null,null,"J9320",370.18,{"$f":"VLOOKUP(E5381,'[1]Combined AA and BB'!$A$1:$C$6133,3,FALSE)","v":"N"}]
[null,null,null,null,"J9325",62.36,{"$f":"VLOOKUP(E5382,'[1]Combined AA and BB'!$A$1:$C$6133,3,FALSE)","v":"N"}]
[null,null,null,null,"J9328",10.42,{"$f":"VLOOKUP(E5383,'[1]Combined AA and BB'!$A$1:$C$6133,3,FALSE)","v":"N"}]
[null,null,null,null,"J9330",32.17,{"$f":"VLOOKUP(E5384,'[1]Combined AA and BB'!$A$1:$C$6133,3,FALSE)","v":"N"}]
[null,null,null,null,"J9340",297.26,{"$f":"VLOOKUP(E5385,'[1]Combined AA and BB'!$A$1:$C$6133,3,FALSE)","v":"N"}]
[null,null,null,null,"J9351","Bundled","NA"]
[null,null,null,null,"J9352",331.83,{"$f":"VLOOKUP(E5387,'[1]Combined AA and BB'!$A$1:$C$6133,3,FALSE)","v":"N"}]
[null,null,null,null,"J9354","Not covered","NA"]
[null,null,null,null,"J9355",80.25,{"$f":"VLOOKUP(E5389,'[1]Combined AA and BB'!$A$1:$C$6133,3,FALSE)","v":"N"}]
[null,null,null,null,"J9357","Not covered","NA"]
[null,null,null,null,"J9360","Bundled","NA"]
[null,null,null,null,"J9370","Bundled","NA"]
[null,null,null,null,"J9371",3420.7809999999999,{"$f":"VLOOKUP(E5393,'[1]Combined AA and BB'!$A$1:$C$6133,3,FALSE)","v":"N"}]
[null,null,null,null,"J9390","Bundled","NA"]
[null,null,null,null,"J9393","Not covered","NA"]
[null,null,null,null,"J9394","Not covered","NA"]
[null,null,null,null,"J9395","Not covered","NA"]
[null,null,null,null,"J9400",7.39,{"$f":"VLOOKUP(E5398,'[1]Combined AA and BB'!$A$1:$C$6133,3,FALSE)","v":"N"}]
[null,null,null,null,"J9600",19991.41,{"$f":"VLOOKUP(E5399,'[1]Combined AA and BB'!$A$1:$C$6133,3,FALSE)","v":"N"}]
[null,null,null,null,"J9999","Bundled","NA"]
[null,null,null,null,"L8600","Bundled","NA"]
[null,null,null,null,"L8603","Bundled","NA"]
[null,null,null,null,"L8604","Bundled","NA"]
[null,null,null,null,"L8606","Bundled","NA"]
[null,null,null,null,"L8609","Not covered","NA"]
[null,null,null,null,"L8610","Bundled","NA"]
[null,null,null,null,"L8612","Bundled","NA"]
[null,null,null,null,"L8613","Bundled","NA"]
[null,null,null,null,"L8614","Bundled","NA"]
[null,null,null,null,"L8630","Bundled","NA"]
[null,null,null,null,"L8631","Bundled","NA"]
[null,null,null,null,"L8641","Bundled","NA"]
[null,null,null,null,"L8642","Bundled","NA"]
[null,null,null,null,"L8658","Bundled","NA"]
[null,null,null,null,"L8659","Bundled","NA"]
[null,null,null,null,"L8670","Bundled","NA"]
[null,null,null,null,"L8682","Bundled","NA"]
[null,null,null,null,"L8690","Bundled","NA"]
[null,null,null,null,"L8699","Bundled","NA"]
[null,null,null,null,"P9041",10.62,{"$f":"VLOOKUP(E5420,'[1]Combined AA and BB'!$A$1:$C$6133,3,FALSE)","v":"N"}]
[null,null,null,null,"P9045",53.08,{"$f":"VLOOKUP(E5421,'[1]Combined AA and BB'!$A$1:$C$6133,3,FALSE)","v":"N"}]
[null,null,null,null,"P9046",21.23,{"$f":"VLOOKUP(E5422,'[1]Combined AA and BB'!$A$1:$C$6133,3,FALSE)","v":"N"}]
[null,null,null,null,"P9047",53.08,{"$f":"VLOOKUP(E5423,'[1]Combined AA and BB'!$A$1:$C$6133,3,FALSE)","v":"N"}]
[null,null,null,null,"Q0138",0.48,{"$f":"VLOOKUP(E5424,'[1]Combined AA and BB'!$A$1:$C$6133,3,FALSE)","v":"N"}]
[null,null,null,null,"Q0161","Bundled","NA"]
[null,null,null,null,"Q0163","Bundled","NA"]
[null,null,null,null,"Q0164","Bundled","NA"]
[null,null,null,null,"Q0166","Bundled","NA"]
[null,null,null,null,"Q0167","Bundled","NA"]
[null,null,null,null,"Q0169","Bundled","NA"]
[null,null,null,null,"Q0173","Bundled","NA"]
[null,null,null,null,"Q0175","Bundled","NA"]
[null,null,null,null,"Q0177","Bundled","NA"]
[null,null,null,null,"Q0180","Bundled","NA"]
[null,null,null,null,"Q2004","Bundled","NA"]
[null,null,null,null,"Q2009","Bundled","NA"]
[null,null,null,null,"Q2017","Bundled","NA"]
[null,null,null,null,"Q2035","Not covered","NA"]
[null,null,null,null,"Q2036","Not covered","NA"]
[null,null,null,null,"Q2037","Not covered","NA"]
[null,null,null,null,"Q2038","Not covered","NA"]
[null,null,null,null,"Q2039","Not covered","NA"]
[null,null,null,null,"Q3027","Not covered","NA"]
[null,null,null,null,"Q4100","Bundled","NA"]
[null,null,null,null,"Q4101","Bundled","NA"]
[null,null,null,null,"Q4102","Bundled","NA"]
[null,null,null,null,"Q4103","Bundled","NA"]
[null,null,null,null,"Q4104","Bundled","NA"]
[null,null,null,null,"Q4105","Bundled","NA"]
[null,null,null,null,"Q4106","Bundled","NA"]
[null,null,null,null,"Q4107","Bundled","NA"]
[null,null,null,null,"Q4108","Bundled","NA"]
[null,null,null,null,"Q4110","Bundled","NA"]
[null,null,null,null,"Q4112","Bundled","NA"]
[null,null,null,null,"Q4113","Bundled","NA"]
[null,null,null,null,"Q4114","Bundled","NA"]
[null,null,null,null,"Q4118","Not covered","NA"]
[null,null,null,null,"Q4121","Not covered","NA"]
[null,null,null,null,"Q4132","Not covered","NA"]
[null,null,null,null,"Q4133","Not covered","NA"]
[null,null,null,null,"Q4137","Not covered","NA"]
[null,null,null,null,"Q4138","Not covered","NA"]
[null,null,null,null,"Q4139","Not covered","NA"]
[null,null,null,null,"Q4140","Not covered","NA"]
[null,null,null,null,"Q4141","Not covered","NA"]
[null,null,null,null,"Q4142","Not covered","NA"]
[null,null,null,null,"Q4143","Not covered","NA"]
[null,null,null,null,"Q4145","Not covered","NA"]
[null,null,null,null,"Q4146","Not covered","NA"]
[null,null,null,null,"Q4147","Not covered","NA"]
[null,null,null,null,"Q4148","Not covered","NA"]
[null,null,null,null,"Q4149","Not covered","NA"]
[null,null,null,null,"Q4150","Not covered","NA"]
[null,null,null,null,"Q4151","Not covered","NA"]
[null,null,null,null,"Q4152","Not covered","NA"]
[null,null,null,null,"Q4153","Not covered","NA"]
[null,null,null,null,"Q4154","Not covered","NA"]
[null,null,null,null,"Q4155","Not covered","NA"]
[null,null,null,null,"Q4156","Not covered","NA"]
[null,null,null,null,"Q4157","Not covered","NA"]
[null,null,null,null,"Q4158","Not covered","NA"]
[null,null,null,null,"Q4159","Not covered","NA"]
[null,null,null,null,"Q4160","Not covered","NA"]
[null,null,null,null,"Q4166","Not covered","NA"]
[null,null,null,null,"Q4167","Not covered","NA"]
[null,null,null,null,"Q4168","Not covered","NA"]
[null,null,null,null,"Q4169","Not covered","NA"]
[null,null,null,null,"Q4170","Not covered","NA"]
[null,null,null,null,"Q4171","Not covered","NA"]
[null,null,null,null,"Q4173","Not covered","NA"]
[null,null,null,null,"Q4174","Not covered","NA"]
[null,null,null,null,"Q4175","Not covered","NA"]
[null,null,null,null,"Q4176","Not covered","NA"]
[null,null,null,null,"Q4177","Not covered","NA"]
[null,null,null,null,"Q4178","Not covered","NA"]
[null,null,null,null,"Q4179","Not covered","NA"]
[null,null,null,null,"Q4180","Not covered","NA"]
[null,null,null,null,"Q4181","Not covered","NA"]
[null,null,null,null,"Q4182","Not covered","NA"]
[null,null,null,null,"Q5117",25.93,{"$f":"VLOOKUP(E5500,'[1]Combined AA and BB'!$A$1:$C$6133,3,FALSE)","v":"N"}]
[null,null,null,null,"Q5122",125.31,{"$f":"VLOOKUP(E5501,'[1]Combined AA and BB'!$A$1:$C$6133,3,FALSE)","v":"N"}]
[null,null,null,null,"Q5126","Not covered","NA"]
[null,null,null,null,"Q9950","Bundled","NA"]
[null,null,null,null,"Q9951","Bundled","NA"]
[null,null,null,null,"Q9953","Bundled","NA"]
[null,null,null,null,"Q9954","Bundled","NA"]
[null,null,null,null,"Q9955","Bundled","NA"]
[null,null,null,null,"Q9956","Bundled","NA"]
[null,null,null,null,"Q9957","Bundled","NA"]
[null,null,null,null,"Q9958","Bundled","NA"]
[null,null,null,null,"Q9959","Bundled","NA"]
[null,null,null,null,"Q9960","Bundled","NA"]
[null,null,null,null,"Q9961","Bundled","NA"]
[null,null,null,null,"Q9962","Bundled","NA"]
[null,null,null,null,"Q9963","Bundled","NA"]
[null,null,null,null,"Q9964","Bundled","NA"]
[null,null,null,null,"Q9965","Bundled","NA"]
[null,null,null,null,"Q9966","Bundled","NA"]
[null,null,null,null,"Q9967","Bundled","NA"]
[null,null,null,null,"Q9968",4.71,{"$f":"VLOOKUP(E5520,'[1]Combined AA and BB'!$A$1:$C$6133,3,FALSE)","v":"N"}]
[null,null,null,null,"V2630","Bundled","NA"]
[null,null,null,null,"V2631","Bundled","NA"]
[null,null,null,null,"V2632","Bundled","NA"]
[null,null,null,null,"V2785","UR/BR",{"$f":"VLOOKUP(E5524,'[1]Combined AA and BB'!$A$1:$C$6133,3,FALSE)","v":"N"}]
[null,null,null,null,"V2790","Bundled","NA"]

{"sheet":"Sheet2","index":1,"n_rows":0,"n_cols":0,"rows_kept":0,"cut":false,"hidden":false,"merged":[]}

{"sheet":"Sheet1","index":2,"n_rows":0,"n_cols":0,"rows_kept":0,"cut":false,"hidden":false,"merged":[]}