{"text_format":"1","workbook":"xlsx","n_sheets":3,"sheets":["Jul 2023 Online","Sheet2","Sheet1"],"not_rendered":{"charts":0,"images":0,"macros":0,"external_links":1,"defined_names":2,"comments":0,"pivot_tables":0},"unopened":[],"bounds":{"document_bytes":16777216,"sheet_cells":100000,"rows_first":2000,"rows_last":500,"rows_between":2000,"halvings":0,"cell_chars":16384,"cell_head_chars":4096},"cells_cut":0,"cells_raw":0,"read":"whole","date_system":"1900"}

{"sheet":"Jul 2023 Online","index":0,"n_rows":5525,"n_cols":7,"rows_kept":5525,"cut":false,"hidden":false,"merged":[]}
[null,null,null,null,"CPT® HCPCS Code","July 2023 ASC Payment Amount","Subject To Multiple Procedure Discounting"]
[null,null,null,null,10004,"Bundled","NA"]
[null,null,null,null,10005,563.74037104996432,{"$f":"VLOOKUP(E3,'[1]Combined AA and BB'!$A$1:$C$6133,3,FALSE)","v":"Y"}]
[null,null,null,null,10006,"Bundled","NA"]
[null,null,null,null,10007,560.86680000000001,{"$f":"VLOOKUP(E5,'[1]Combined AA and BB'!$A$1:$C$6133,3,FALSE)","v":"Y"}]
[null,null,null,null,10008,"Bundled","NA"]
[null,null,null,null,10009,563.74037104996432,{"$f":"VLOOKUP(E7,'[1]Combined AA and BB'!$A$1:$C$6133,3,FALSE)","v":"Y"}]
[null,null,null,null,10010,"Bundled","NA"]
[null,null,null,null,10011,563.74037104996432,{"$f":"VLOOKUP(E9,'[1]Combined AA and BB'!$A$1:$C$6133,3,FALSE)","v":"Y"}]
[null,null,null,null,10012,"Bundled","NA"]
[null,null,null,null,10021,"Not covered","NA"]
[null,null,null,null,10030,563.74037104996432,{"$f":"VLOOKUP(E12,'[1]Combined AA and BB'!$A$1:$C$6133,3,FALSE)","v":"Y"}]
[null,null,null,null,10035,"Not covered","NA"]
[null,null,null,null,10036,"Not covered","NA"]
[null,null,null,null,10040,"Bundled","NA"]
[null,null,null,null,10060,234.58759999999998,{"$f":"VLOOKUP(E16,'[1]Combined AA and BB'!$A$1:$C$6133,3,FALSE)","v":"Y"}]
[null,null,null,null,10061,394.15480000000002,{"$f":"VLOOKUP(E17,'[1]Combined AA and BB'!$A$1:$C$6133,3,FALSE)","v":"Y"}]
[null,null,null,null,10080,478.70159999999993,{"$f":"VLOOKUP(E18,'[1]Combined AA and BB'!$A$1:$C$6133,3,FALSE)","v":"Y"}]
[null,null,null,null,10081,647.19979999999998,{"$f":"VLOOKUP(E19,'[1]Combined AA and BB'!$A$1:$C$6133,3,FALSE)","v":"Y"}]
[null,null,null,null,10120,284.00579999999997,{"$f":"VLOOKUP(E20,'[1]Combined AA and BB'!$A$1:$C$6133,3,FALSE)","v":"Y"}]
[null,null,null,null,10121,1062.8859418079082,{"$f":"VLOOKUP(E21,'[1]Combined AA and BB'!$A$1:$C$6133,3,FALSE)","v":"Y"}]
[null,null,null,null,10140,315.56200000000001,{"$f":"VLOOKUP(E22,'[1]Combined AA and BB'!$A$1:$C$6133,3,FALSE)","v":"Y"}]
[null,null,null,null,10160,242.32780000000002,{"$f":"VLOOKUP(E23,'[1]Combined AA and BB'!$A$1:$C$6133,3,FALSE)","v":"Y"}]
[null,null,null,null,10180,1789.2422303467429,{"$f":"VLOOKUP(E24,'[1]Combined AA and BB'!$A$1:$C$6133,3,FALSE)","v":"Y"}]
[null,null,null,null,11000,107.76739999999999,{"$f":"VLOOKUP(E25,'[1]Combined AA and BB'!$A$1:$C$6133,3,FALSE)","v":"Y"}]
[null,null,null,null,11001,"Bundled","NA"]
[null,null,null,null,11010,563.74037104996432,{"$f":"VLOOKUP(E27,'[1]Combined AA and BB'!$A$1:$C$6133,3,FALSE)","v":"Y"}]
[null,null,null,null,11011,563.74037104996432,{"$f":"VLOOKUP(E28,'[1]Combined AA and BB'!$A$1:$C$6133,3,FALSE)","v":"Y"}]
[null,null,null,null,11012,1789.2422303467429,{"$f":"VLOOKUP(E29,'[1]Combined AA and BB'!$A$1:$C$6133,3,FALSE)","v":"Y"}]
[null,null,null,null,11042,324.06399005482393,{"$f":"VLOOKUP(E30,'[1]Combined AA and BB'!$A$1:$C$6133,3,FALSE)","v":"Y"}]
[null,null,null,null,11043,504.64741795035388,{"$f":"VLOOKUP(E31,'[1]Combined AA and BB'!$A$1:$C$6133,3,FALSE)","v":"Y"}]
[null,null,null,null,11044,1062.8859418079082,{"$f":"VLOOKUP(E32,'[1]Combined AA and BB'!$A$1:$C$6133,3,FALSE)","v":"Y"}]
[null,null,null,null,11045,"Bundled","NA"]
[null,null,null,null,11046,"Bundled","NA"]
[null,null,null,null,11047,"Bundled","NA"]
[null,null,null,null,11055,"Bundled","NA"]
[null,null,null,null,11056,"Bundled","NA"]
[null,null,null,null,11057,169.68899999999999,{"$f":"VLOOKUP(E38,'[1]Combined AA and BB'!$A$1:$C$6133,3,FALSE)","v":"Y"}]
[null,null,null,null,11102,191.71880000000002,{"$f":"VLOOKUP(E39,'[1]Combined AA and BB'!$A$1:$C$6133,3,FALSE)","v":"Y"}]
[null,null,null,null,11103,"Bundled","NA"]
[null,null,null,null,11104,237.56460000000001,{"$f":"VLOOKUP(E41,'[1]Combined AA and BB'!$A$1:$C$6133,3,FALSE)","v":"Y"}]
[null,null,null,null,11105,"Bundled","NA"]
[null,null,null,null,11106,294.12760000000003,{"$f":"VLOOKUP(E43,'[1]Combined AA and BB'!$A$1:$C$6133,3,FALSE)","v":"Y"}]
[null,null,null,null,11107,"Bundled","NA"]
[null,null,null,null,11200,"Bundled","NA"]
[null,null,null,null,11201,"Bundled","NA"]
[null,null,null,null,11300,"Bundled","NA"]
[null,null,null,null,11301,"Bundled","NA"]
[null,null,null,null,11302,"Bundled","NA"]
[null,null,null,null,11303,"Bundled","NA"]
[null,null,null,null,11305,"Bundled","NA"]
[null,null,null,null,11306,"Bundled","NA"]
[null,null,null,null,11307,156.86319990561176,{"$f":"VLOOKUP(E53,'[1]Combined AA and BB'!$A$1:$C$6133,3,FALSE)","v":"Y"}]
[null,null,null,null,11308,"Bundled","NA"]
[null,null,null,null,11310,220.298,{"$f":"VLOOKUP(E55,'[1]Combined AA and BB'!$A$1:$C$6133,3,FALSE)","v":"Y"}]
[null,null,null,null,11311,156.86319990561176,{"$f":"VLOOKUP(E56,'[1]Combined AA and BB'!$A$1:$C$6133,3,FALSE)","v":"Y"}]
[null,null,null,null,11312,294.12760000000003,{"$f":"VLOOKUP(E57,'[1]Combined AA and BB'!$A$1:$C$6133,3,FALSE)","v":"Y"}]
[null,null,null,null,11313,339.97339999999997,{"$f":"VLOOKUP(E58,'[1]Combined AA and BB'!$A$1:$C$6133,3,FALSE)","v":"Y"}]
[null,null,null,null,11400,241.73239999999998,{"$f":"VLOOKUP(E59,'[1]Combined AA and BB'!$A$1:$C$6133,3,FALSE)","v":"Y"}]
[null,null,null,null,11401,293.53219999999999,{"$f":"VLOOKUP(E60,'[1]Combined AA and BB'!$A$1:$C$6133,3,FALSE)","v":"Y"}]
[null,null,null,null,11402,322.1114,{"$f":"VLOOKUP(E61,'[1]Combined AA and BB'!$A$1:$C$6133,3,FALSE)","v":"Y"}]
[null,null,null,null,11403,369.14800000000002,{"$f":"VLOOKUP(E62,'[1]Combined AA and BB'!$A$1:$C$6133,3,FALSE)","v":"Y"}]
[null,null,null,null,11404,1062.8859418079082,{"$f":"VLOOKUP(E63,'[1]Combined AA and BB'!$A$1:$C$6133,3,FALSE)","v":"Y"}]
[null,null,null,null,11406,1062.8859418079082,{"$f":"VLOOKUP(E64,'[1]Combined AA and BB'!$A$1:$C$6133,3,FALSE)","v":"Y"}]
[null,null,null,null,11420,239.9462,{"$f":"VLOOKUP(E65,'[1]Combined AA and BB'!$A$1:$C$6133,3,FALSE)","v":"Y"}]
[null,null,null,null,11421,300.08159999999998,{"$f":"VLOOKUP(E66,'[1]Combined AA and BB'!$A$1:$C$6133,3,FALSE)","v":"Y"}]
[null,null,null,null,11422,335.80559999999997,{"$f":"VLOOKUP(E67,'[1]Combined AA and BB'!$A$1:$C$6133,3,FALSE)","v":"Y"}]
[null,null,null,null,11423,381.65140000000002,{"$f":"VLOOKUP(E68,'[1]Combined AA and BB'!$A$1:$C$6133,3,FALSE)","v":"Y"}]
[null,null,null,null,11424,1062.8859418079082,{"$f":"VLOOKUP(E69,'[1]Combined AA and BB'!$A$1:$C$6133,3,FALSE)","v":"Y"}]
[null,null,null,null,11426,1789.2422303467429,{"$f":"VLOOKUP(E70,'[1]Combined AA and BB'!$A$1:$C$6133,3,FALSE)","v":"Y"}]
[null,null,null,null,11440,270.90699999999998,{"$f":"VLOOKUP(E71,'[1]Combined AA and BB'!$A$1:$C$6133,3,FALSE)","v":"Y"}]
[null,null,null,null,11441,326.2792,{"$f":"VLOOKUP(E72,'[1]Combined AA and BB'!$A$1:$C$6133,3,FALSE)","v":"Y"}]
[null,null,null,null,11442,362.00319999999999,{"$f":"VLOOKUP(E73,'[1]Combined AA and BB'!$A$1:$C$6133,3,FALSE)","v":"Y"}]
[null,null,null,null,11443,425.11559999999997,{"$f":"VLOOKUP(E74,'[1]Combined AA and BB'!$A$1:$C$6133,3,FALSE)","v":"Y"}]
[null,null,null,null,11444,1062.8859418079082,{"$f":"VLOOKUP(E75,'[1]Combined AA and BB'!$A$1:$C$6133,3,FALSE)","v":"Y"}]
[null,null,null,null,11446,1789.2422303467429,{"$f":"VLOOKUP(E76,'[1]Combined AA and BB'!$A$1:$C$6133,3,FALSE)","v":"Y"}]
[null,null,null,null,11450,1789.2422303467429,{"$f":"VLOOKUP(E77,'[1]Combined AA and BB'!$A$1:$C$6133,3,FALSE)","v":"Y"}]
[null,null,null,null,11451,1789.2422303467429,{"$f":"VLOOKUP(E78,'[1]Combined AA and BB'!$A$1:$C$6133,3,FALSE)","v":"Y"}]
[null,null,null,null,11462,1789.2422303467429,{"$f":"VLOOKUP(E79,'[1]Combined AA and BB'!$A$1:$C$6133,3,FALSE)","v":"Y"}]
[null,null,null,null,11463,1789.2422303467429,{"$f":"VLOOKUP(E80,'[1]Combined AA and BB'!$A$1:$C$6133,3,FALSE)","v":"Y"}]
[null,null,null,null,11470,1789.2422303467429,{"$f":"VLOOKUP(E81,'[1]Combined AA and BB'!$A$1:$C$6133,3,FALSE)","v":"Y"}]
[null,null,null,null,11471,1789.2422303467429,{"$f":"VLOOKUP(E82,'[1]Combined AA and BB'!$A$1:$C$6133,3,FALSE)","v":"Y"}]
[null,null,null,null,11600,370.93420000000003,{"$f":"VLOOKUP(E83,'[1]Combined AA and BB'!$A$1:$C$6133,3,FALSE)","v":"Y"}]
[null,null,null,null,11601,428.0926,{"$f":"VLOOKUP(E84,'[1]Combined AA and BB'!$A$1:$C$6133,3,FALSE)","v":"Y"}]
[null,null,null,null,11602,457.86260000000004,{"$f":"VLOOKUP(E85,'[1]Combined AA and BB'!$A$1:$C$6133,3,FALSE)","v":"Y"}]
[null,null,null,null,11603,520.37959999999998,{"$f":"VLOOKUP(E86,'[1]Combined AA and BB'!$A$1:$C$6133,3,FALSE)","v":"Y"}]
[null,null,null,null,11604,563.74037104996432,{"$f":"VLOOKUP(E87,'[1]Combined AA and BB'!$A$1:$C$6133,3,FALSE)","v":"Y"}]
[null,null,null,null,11606,1062.8859418079082,{"$f":"VLOOKUP(E88,'[1]Combined AA and BB'!$A$1:$C$6133,3,FALSE)","v":"Y"}]
[null,null,null,null,11620,372.72039999999998,{"$f":"VLOOKUP(E89,'[1]Combined AA and BB'!$A$1:$C$6133,3,FALSE)","v":"Y"}]
[null,null,null,null,11621,430.4742,{"$f":"VLOOKUP(E90,'[1]Combined AA and BB'!$A$1:$C$6133,3,FALSE)","v":"Y"}]
[null,null,null,null,11622,472.74760000000003,{"$f":"VLOOKUP(E91,'[1]Combined AA and BB'!$A$1:$C$6133,3,FALSE)","v":"Y"}]
[null,null,null,null,11623,550.745,{"$f":"VLOOKUP(E92,'[1]Combined AA and BB'!$A$1:$C$6133,3,FALSE)","v":"Y"}]
[null,null,null,null,11624,1062.8859418079082,{"$f":"VLOOKUP(E93,'[1]Combined AA and BB'!$A$1:$C$6133,3,FALSE)","v":"Y"}]
[null,null,null,null,11626,1789.2422303467429,{"$f":"VLOOKUP(E94,'[1]Combined AA and BB'!$A$1:$C$6133,3,FALSE)","v":"Y"}]
[null,null,null,null,11640,381.65140000000002,{"$f":"VLOOKUP(E95,'[1]Combined AA and BB'!$A$1:$C$6133,3,FALSE)","v":"Y"}]
[null,null,null,null,11641,444.16840000000002,{"$f":"VLOOKUP(E96,'[1]Combined AA and BB'!$A$1:$C$6133,3,FALSE)","v":"Y"}]
[null,null,null,null,11642,500.13600000000002,{"$f":"VLOOKUP(E97,'[1]Combined AA and BB'!$A$1:$C$6133,3,FALSE)","v":"Y"}]
[null,null,null,null,11643,585.27819999999997,{"$f":"VLOOKUP(E98,'[1]Combined AA and BB'!$A$1:$C$6133,3,FALSE)","v":"Y"}]
[null,null,null,null,11644,1062.8859418079082,{"$f":"VLOOKUP(E99,'[1]Combined AA and BB'!$A$1:$C$6133,3,FALSE)","v":"Y"}]
[null,null,null,null,11646,1789.2422303467429,{"$f":"VLOOKUP(E100,'[1]Combined AA and BB'!$A$1:$C$6133,3,FALSE)","v":"Y"}]
[null,null,null,null,11719,"Bundled","NA"]
[null,null,null,null,11720,"Bundled","NA"]
[null,null,null,null,11721,"Bundled","NA"]
[null,null,null,null,11730,"Bundled","NA"]
[null,null,null,null,11732,"Bundled","NA"]
[null,null,null,null,11740,"Bundled","NA"]
[null,null,null,null,11750,297.7,{"$f":"VLOOKUP(E107,'[1]Combined AA and BB'!$A$1:$C$6133,3,FALSE)","v":"Y"}]
[null,null,null,null,11755,229.22900000000001,{"$f":"VLOOKUP(E108,'[1]Combined AA and BB'!$A$1:$C$6133,3,FALSE)","v":"Y"}]
[null,null,null,null,11760,350.69059999999996,{"$f":"VLOOKUP(E109,'[1]Combined AA and BB'!$A$1:$C$6133,3,FALSE)","v":"Y"}]
[null,null,null,null,11762,536.45539999999994,{"$f":"VLOOKUP(E110,'[1]Combined AA and BB'!$A$1:$C$6133,3,FALSE)","v":"Y"}]
[null,null,null,null,11765,"Bundled","NA"]
[null,null,null,null,11770,1789.2422303467429,{"$f":"VLOOKUP(E112,'[1]Combined AA and BB'!$A$1:$C$6133,3,FALSE)","v":"Y"}]
[null,null,null,null,11771,1789.2422303467429,{"$f":"VLOOKUP(E113,'[1]Combined AA and BB'!$A$1:$C$6133,3,FALSE)","v":"Y"}]
[null,null,null,null,11772,1789.2422303467429,{"$f":"VLOOKUP(E114,'[1]Combined AA and BB'!$A$1:$C$6133,3,FALSE)","v":"Y"}]
[null,null,null,null,11900,"Bundled","NA"]
[null,null,null,null,11901,"Bundled","NA"]
[null,null,null,null,11920,359.6216,{"$f":"VLOOKUP(E117,'[1]Combined AA and BB'!$A$1:$C$6133,3,FALSE)","v":"Y"}]
[null,null,null,null,11921,417.37539999999996,{"$f":"VLOOKUP(E118,'[1]Combined AA and BB'!$A$1:$C$6133,3,FALSE)","v":"Y"}]
[null,null,null,null,11922,"Bundled","NA"]
[null,null,null,null,11950,151.23159999999999,{"$f":"VLOOKUP(E120,'[1]Combined AA and BB'!$A$1:$C$6133,3,FALSE)","v":"Y"}]
[null,null,null,null,11951,199.459,{"$f":"VLOOKUP(E121,'[1]Combined AA and BB'!$A$1:$C$6133,3,FALSE)","v":"Y"}]
[null,null,null,null,11952,266.1438,{"$f":"VLOOKUP(E122,'[1]Combined AA and BB'!$A$1:$C$6133,3,FALSE)","v":"Y"}]
[null,null,null,null,11954,292.93680000000001,{"$f":"VLOOKUP(E123,'[1]Combined AA and BB'!$A$1:$C$6133,3,FALSE)","v":"Y"}]
[null,null,null,null,11960,2825.7867811155184,{"$f":"VLOOKUP(E124,'[1]Combined AA and BB'!$A$1:$C$6133,3,FALSE)","v":"Y"}]
[null,null,null,null,11970,8854.0515688595315,{"$f":"VLOOKUP(E125,'[1]Combined AA and BB'!$A$1:$C$6133,3,FALSE)","v":"Y"}]
[null,null,null,null,11971,1789.2422303467429,{"$f":"VLOOKUP(E126,'[1]Combined AA and BB'!$A$1:$C$6133,3,FALSE)","v":"N"}]
[null,null,null,null,11976,"Not covered","NA"]
[null,null,null,null,11980,"Not covered","NA"]
[null,null,null,null,11981,"Bundled","NA"]
[null,null,null,null,11982,"Bundled","NA"]
[null,null,null,null,11983,"Bundled","NA"]
[null,null,null,null,12001,"Bundled","NA"]
[null,null,null,null,12002,"Bundled","NA"]
[null,null,null,null,12004,"Bundled","NA"]
[null,null,null,null,12005,324.06399005482393,{"$f":"VLOOKUP(E135,'[1]Combined AA and BB'!$A$1:$C$6133,3,FALSE)","v":"N"}]
[null,null,null,null,12006,324.06399005482393,{"$f":"VLOOKUP(E136,'[1]Combined AA and BB'!$A$1:$C$6133,3,FALSE)","v":"N"}]
[null,null,null,null,12007,156.86319990561176,{"$f":"VLOOKUP(E137,'[1]Combined AA and BB'!$A$1:$C$6133,3,FALSE)","v":"Y"}]
[null,null,null,null,12011,"Bundled","NA"]
[null,null,null,null,12013,"Bundled","NA"]
[null,null,null,null,12014,"Bundled","NA"]
[null,null,null,null,12015,156.86319990561176,{"$f":"VLOOKUP(E141,'[1]Combined AA and BB'!$A$1:$C$6133,3,FALSE)","v":"N"}]
[null,null,null,null,12016,324.06399005482393,{"$f":"VLOOKUP(E142,'[1]Combined AA and BB'!$A$1:$C$6133,3,FALSE)","v":"N"}]
[null,null,null,null,12017,324.06399005482393,{"$f":"VLOOKUP(E143,'[1]Combined AA and BB'!$A$1:$C$6133,3,FALSE)","v":"N"}]
[null,null,null,null,12018,156.86319990561176,{"$f":"VLOOKUP(E144,'[1]Combined AA and BB'!$A$1:$C$6133,3,FALSE)","v":"N"}]
[null,null,null,null,12020,504.64741795035388,{"$f":"VLOOKUP(E145,'[1]Combined AA and BB'!$A$1:$C$6133,3,FALSE)","v":"Y"}]
[null,null,null,null,12021,324.06399005482393,{"$f":"VLOOKUP(E146,'[1]Combined AA and BB'!$A$1:$C$6133,3,FALSE)","v":"Y"}]
[null,null,null,null,12031,497.15899999999999,{"$f":"VLOOKUP(E147,'[1]Combined AA and BB'!$A$1:$C$6133,3,FALSE)","v":"Y"}]
[null,null,null,null,12032,324.06399005482393,{"$f":"VLOOKUP(E148,'[1]Combined AA and BB'!$A$1:$C$6133,3,FALSE)","v":"Y"}]
[null,null,null,null,12034,324.06399005482393,{"$f":"VLOOKUP(E149,'[1]Combined AA and BB'!$A$1:$C$6133,3,FALSE)","v":"Y"}]
[null,null,null,null,12035,324.06399005482393,{"$f":"VLOOKUP(E150,'[1]Combined AA and BB'!$A$1:$C$6133,3,FALSE)","v":"Y"}]
[null,null,null,null,12036,504.64741795035388,{"$f":"VLOOKUP(E151,'[1]Combined AA and BB'!$A$1:$C$6133,3,FALSE)","v":"Y"}]
[null,null,null,null,12037,1499.1841543066416,{"$f":"VLOOKUP(E152,'[1]Combined AA and BB'!$A$1:$C$6133,3,FALSE)","v":"Y"}]
[null,null,null,null,12041,498.34979999999996,{"$f":"VLOOKUP(E153,'[1]Combined AA and BB'!$A$1:$C$6133,3,FALSE)","v":"N"}]
[null,null,null,null,12042,324.06399005482393,{"$f":"VLOOKUP(E154,'[1]Combined AA and BB'!$A$1:$C$6133,3,FALSE)","v":"Y"}]
[null,null,null,null,12044,504.64741795035388,{"$f":"VLOOKUP(E155,'[1]Combined AA and BB'!$A$1:$C$6133,3,FALSE)","v":"Y"}]
[null,null,null,null,12045,504.64741795035388,{"$f":"VLOOKUP(E156,'[1]Combined AA and BB'!$A$1:$C$6133,3,FALSE)","v":"Y"}]
[null,null,null,null,12046,504.64741795035388,{"$f":"VLOOKUP(E157,'[1]Combined AA and BB'!$A$1:$C$6133,3,FALSE)","v":"Y"}]
[null,null,null,null,12047,1499.1841543066416,{"$f":"VLOOKUP(E158,'[1]Combined AA and BB'!$A$1:$C$6133,3,FALSE)","v":"Y"}]
[null,null,null,null,12051,324.06399005482393,{"$f":"VLOOKUP(E159,'[1]Combined AA and BB'!$A$1:$C$6133,3,FALSE)","v":"Y"}]
[null,null,null,null,12052,324.06399005482393,{"$f":"VLOOKUP(E160,'[1]Combined AA and BB'!$A$1:$C$6133,3,FALSE)","v":"Y"}]
[null,null,null,null,12053,324.06399005482393,{"$f":"VLOOKUP(E161,'[1]Combined AA and BB'!$A$1:$C$6133,3,FALSE)","v":"Y"}]
[null,null,null,null,12054,324.06399005482393,{"$f":"VLOOKUP(E162,'[1]Combined AA and BB'!$A$1:$C$6133,3,FALSE)","v":"N"}]
[null,null,null,null,12055,324.06399005482393,{"$f":"VLOOKUP(E163,'[1]Combined AA and BB'!$A$1:$C$6133,3,FALSE)","v":"Y"}]
[null,null,null,null,12056,324.06399005482393,{"$f":"VLOOKUP(E164,'[1]Combined AA and BB'!$A$1:$C$6133,3,FALSE)","v":"N"}]
[null,null,null,null,12057,324.06399005482393,{"$f":"VLOOKUP(E165,'[1]Combined AA and BB'!$A$1:$C$6133,3,FALSE)","v":"Y"}]
[null,null,null,null,13100,504.64741795035388,{"$f":"VLOOKUP(E166,'[1]Combined AA and BB'!$A$1:$C$6133,3,FALSE)","v":"Y"}]
[null,null,null,null,13101,504.64741795035388,{"$f":"VLOOKUP(E167,'[1]Combined AA and BB'!$A$1:$C$6133,3,FALSE)","v":"Y"}]
[null,null,null,null,13102,"Bundled","NA"]
[null,null,null,null,13120,504.64741795035388,{"$f":"VLOOKUP(E169,'[1]Combined AA and BB'!$A$1:$C$6133,3,FALSE)","v":"Y"}]
[null,null,null,null,13121,504.64741795035388,{"$f":"VLOOKUP(E170,'[1]Combined AA and BB'!$A$1:$C$6133,3,FALSE)","v":"Y"}]
[null,null,null,null,13122,"Bundled","NA"]
[null,null,null,null,13131,324.06399005482393,{"$f":"VLOOKUP(E172,'[1]Combined AA and BB'!$A$1:$C$6133,3,FALSE)","v":"Y"}]
[null,null,null,null,13132,504.64741795035388,{"$f":"VLOOKUP(E173,'[1]Combined AA and BB'!$A$1:$C$6133,3,FALSE)","v":"Y"}]
[null,null,null,null,13133,"Bundled","NA"]
[null,null,null,null,13151,504.64741795035388,{"$f":"VLOOKUP(E175,'[1]Combined AA and BB'!$A$1:$C$6133,3,FALSE)","v":"Y"}]
[null,null,null,null,13152,504.64741795035388,{"$f":"VLOOKUP(E176,'[1]Combined AA and BB'!$A$1:$C$6133,3,FALSE)","v":"Y"}]
[null,null,null,null,13153,"Bundled","NA"]
[null,null,null,null,13160,1499.1841543066416,{"$f":"VLOOKUP(E178,'[1]Combined AA and BB'!$A$1:$C$6133,3,FALSE)","v":"Y"}]
[null,null,null,null,14000,1499.1841543066416,{"$f":"VLOOKUP(E179,'[1]Combined AA and BB'!$A$1:$C$6133,3,FALSE)","v":"Y"}]
[null,null,null,null,14001,1499.1841543066416,{"$f":"VLOOKUP(E180,'[1]Combined AA and BB'!$A$1:$C$6133,3,FALSE)","v":"Y"}]
[null,null,null,null,14020,1499.1841543066416,{"$f":"VLOOKUP(E181,'[1]Combined AA and BB'!$A$1:$C$6133,3,FALSE)","v":"Y"}]
[null,null,null,null,14021,1499.1841543066416,{"$f":"VLOOKUP(E182,'[1]Combined AA and BB'!$A$1:$C$6133,3,FALSE)","v":"Y"}]
[null,null,null,null,14040,1499.1841543066416,{"$f":"VLOOKUP(E183,'[1]Combined AA and BB'!$A$1:$C$6133,3,FALSE)","v":"Y"}]
[null,null,null,null,14041,1499.1841543066416,{"$f":"VLOOKUP(E184,'[1]Combined AA and BB'!$A$1:$C$6133,3,FALSE)","v":"Y"}]
[null,null,null,null,14060,1499.1841543066416,{"$f":"VLOOKUP(E185,'[1]Combined AA and BB'!$A$1:$C$6133,3,FALSE)","v":"Y"}]
[null,null,null,null,14061,1499.1841543066416,{"$f":"VLOOKUP(E186,'[1]Combined AA and BB'!$A$1:$C$6133,3,FALSE)","v":"Y"}]
[null,null,null,null,14301,2825.7867811155184,{"$f":"VLOOKUP(E187,'[1]Combined AA and BB'!$A$1:$C$6133,3,FALSE)","v":"Y"}]
[null,null,null,null,14302,"Bundled","NA"]
[null,null,null,null,14350,1499.1841543066416,{"$f":"VLOOKUP(E189,'[1]Combined AA and BB'!$A$1:$C$6133,3,FALSE)","v":"Y"}]
[null,null,null,null,15002,1499.1841543066416,{"$f":"VLOOKUP(E190,'[1]Combined AA and BB'!$A$1:$C$6133,3,FALSE)","v":"Y"}]
[null,null,null,null,15003,"Bundled","NA"]
[null,null,null,null,15004,504.64741795035388,{"$f":"VLOOKUP(E192,'[1]Combined AA and BB'!$A$1:$C$6133,3,FALSE)","v":"Y"}]
[null,null,null,null,15005,"Bundled","NA"]
[null,null,null,null,15040,1499.1841543066416,{"$f":"VLOOKUP(E194,'[1]Combined AA and BB'!$A$1:$C$6133,3,FALSE)","v":"Y"}]
[null,null,null,null,15050,504.64741795035388,{"$f":"VLOOKUP(E195,'[1]Combined AA and BB'!$A$1:$C$6133,3,FALSE)","v":"Y"}]
[null,null,null,null,15100,1499.1841543066416,{"$f":"VLOOKUP(E196,'[1]Combined AA and BB'!$A$1:$C$6133,3,FALSE)","v":"Y"}]
[null,null,null,null,15101,"Bundled","NA"]
[null,null,null,null,15110,1499.1841543066416,{"$f":"VLOOKUP(E198,'[1]Combined AA and BB'!$A$1:$C$6133,3,FALSE)","v":"Y"}]
[null,null,null,null,15111,"Bundled","NA"]
[null,null,null,null,15115,1499.1841543066416,{"$f":"VLOOKUP(E200,'[1]Combined AA and BB'!$A$1:$C$6133,3,FALSE)","v":"Y"}]
{"$rows_left_out":5326}
{"sheet":"Sheet2","index":1,"n_rows":0,"n_cols":0,"rows_kept":0,"cut":false,"hidden":false,"merged":[]}

{"sheet":"Sheet1","index":2,"n_rows":0,"n_cols":0,"rows_kept":0,"cut":false,"hidden":false,"merged":[]}